BDBM50008496 CHEMBL3235556
SMILES: COc1cccc(CC(=O)Nc2nc3ccc(cc3s2)C(F)(F)F)c1
InChI Key: InChIKey=BSYSLYHIEAROBS-UHFFFAOYSA-N
Data: 1 IC50
Activity Spreadsheet -- Enzyme Inhibition Constant Data from BindingDB
Found 1 hit for monomerid = 50008496
Trg + Lig
Ki
nM
ΔG°
kcal/mole
IC50
nM
Kd
nM
EC50/IC50
nM
koff
s-1
kon
M-1s-1
pHTemp
°C
Casein kinase I isoform delta
(Homo sapiens (Human))
BDBM50008496
(CHEMBL3235556)
Show SMILES COc1cccc(CC(=O)Nc2nc3ccc(cc3s2)C(F)(F)F)c1
Show InChI InChI=1S/C17H13F3N2O2S/c1-24-12-4-2-3-10(7-12)8-15(23)22-16-21-13-6-5-11(17(18,19)20)9-14(13)25-16/h2-7,9H,8H2,1H3,(H,21,22,23)
n/an/a 42n/an/an/an/an/an/a
CSIC
Curated by ChEMBL
Assay Description
Inhibition of human recombinant CK-1delta using casein as substrate after 60 mins by Kinase-Glo assay
J Med Chem 57: 2755-72 (2014)
Article DOI: 10.1021/jm500065f
BindingDB Entry DOI: 10.7270/Q21N82NV