BDBM50008498 CHEMBL3235558
SMILES: CCOc1ccc2nc(NC(=O)Cc3cccc(OC)c3)sc2c1
InChI Key: InChIKey=CTIKYEPDLNEZRY-UHFFFAOYSA-N
Data: 1 IC50
Activity Spreadsheet -- Enzyme Inhibition Constant Data from BindingDB
Found 1 hit for monomerid = 50008498
Trg + Lig
Ki
nM
ΔG°
kcal/mole
IC50
nM
Kd
nM
EC50/IC50
nM
koff
s-1
kon
M-1s-1
pHTemp
°C
Casein kinase I isoform delta
(Homo sapiens (Human))
BDBM50008498
(CHEMBL3235558)
Show SMILES CCOc1ccc2nc(NC(=O)Cc3cccc(OC)c3)sc2c1
Show InChI InChI=1S/C18H18N2O3S/c1-3-23-14-7-8-15-16(11-14)24-18(19-15)20-17(21)10-12-5-4-6-13(9-12)22-2/h4-9,11H,3,10H2,1-2H3,(H,19,20,21)
n/an/a 990n/an/an/an/an/an/a
CSIC
Curated by ChEMBL
Assay Description
Inhibition of human recombinant CK-1delta using casein as substrate after 60 mins by Kinase-Glo assay
J Med Chem 57: 2755-72 (2014)
Article DOI: 10.1021/jm500065f
BindingDB Entry DOI: 10.7270/Q21N82NV