BDBM50008503 CHEMBL3235563
SMILES: FC(F)(F)c1ccc2nc(NC(=O)Cc3ccccc3)sc2c1
InChI Key: InChIKey=WYPGOAOLLLOOOT-UHFFFAOYSA-N
Data: 1 IC50
Activity Spreadsheet -- Enzyme Inhibition Constant Data from BindingDB
Found 1 hit for monomerid = 50008503
Trg + Lig
Ki
nM
ΔG°
kcal/mole
IC50
nM
Kd
nM
EC50/IC50
nM
koff
s-1
kon
M-1s-1
pHTemp
°C
Casein kinase I isoform delta
(Homo sapiens (Human))
BDBM50008503
(CHEMBL3235563)
Show SMILES FC(F)(F)c1ccc2nc(NC(=O)Cc3ccccc3)sc2c1
Show InChI InChI=1S/C16H11F3N2OS/c17-16(18,19)11-6-7-12-13(9-11)23-15(20-12)21-14(22)8-10-4-2-1-3-5-10/h1-7,9H,8H2,(H,20,21,22)
n/an/a 47n/an/an/an/an/an/a
CSIC
Curated by ChEMBL
Assay Description
Inhibition of human recombinant CK-1delta using casein as substrate after 60 mins by Kinase-Glo assay
J Med Chem 57: 2755-72 (2014)
Article DOI: 10.1021/jm500065f
BindingDB Entry DOI: 10.7270/Q21N82NV