null
SMILES: CC(C)(C)S(=O)(=O)C[C@H](C1CC1)N1[C@@H]([C@H](C[C@](C)(Cc2ncc(s2)C(=O)CO)C1=O)c1cccc(Cl)c1)c1ccc(Cl)cc1
InChI Key: InChIKey=SYEJHQQRLZNDAL-GXAGMUTGSA-N
Activity Spreadsheet -- Enzyme Inhibition Constant Data from BindingDB
Found 3 hits for monomerid = 50008766
Trg + Lig
Ki
nM
ΔG°
kcal/mole
IC50
nM
Kd
nM
EC50/IC50
nM
koff
s-1
kon
M-1s-1
pHTemp
°C
E3 ubiquitin-protein ligase Mdm2
(Homo sapiens (Human))
BDBM50008766
(CHEMBL3236654)
Show SMILES CC(C)(C)S(=O)(=O)C[C@H](C1CC1)N1[C@@H]([C@H](C[C@](C)(Cc2ncc(s2)C(=O)CO)C1=O)c1cccc(Cl)c1)c1ccc(Cl)cc1 |r|
Show InChI InChI=1S/C33H38Cl2N2O5S2/c1-32(2,3)44(41,42)19-26(20-8-9-20)37-30(21-10-12-23(34)13-11-21)25(22-6-5-7-24(35)14-22)15-33(4,31(37)40)16-29-36-17-28(43-29)27(39)18-38/h5-7,10-14,17,20,25-26,30,38H,8-9,15-16,18-19H2,1-4H3/t25-,26-,30-,33-/m1/s1
NCI pathway
Reactome pathway
n/an/a 0.100n/an/an/an/an/an/a
Amgen Inc.
Curated by ChEMBL
Assay Description
Binding affinity to GST-thrombin-tagged human MDM2 (1 to 188) expressed in Escherichia coli assessed as inhibition of interaction with p53 in serum f...
J Med Chem 57: 2963-88 (2014)
Article DOI: 10.1021/jm401911v
BindingDB Entry DOI: 10.7270/Q2862J0J
E3 ubiquitin-protein ligase Mdm2
(Homo sapiens (Human))
BDBM50008766
(CHEMBL3236654)
Show SMILES CC(C)(C)S(=O)(=O)C[C@H](C1CC1)N1[C@@H]([C@H](C[C@](C)(Cc2ncc(s2)C(=O)CO)C1=O)c1cccc(Cl)c1)c1ccc(Cl)cc1 |r|
Show InChI InChI=1S/C33H38Cl2N2O5S2/c1-32(2,3)44(41,42)19-26(20-8-9-20)37-30(21-10-12-23(34)13-11-21)25(22-6-5-7-24(35)14-22)15-33(4,31(37)40)16-29-36-17-28(43-29)27(39)18-38/h5-7,10-14,17,20,25-26,30,38H,8-9,15-16,18-19H2,1-4H3/t25-,26-,30-,33-/m1/s1
NCI pathway
Reactome pathway
n/an/a 1.70n/an/an/an/an/an/a
Amgen Inc.
Curated by ChEMBL
Assay Description
Binding affinity to GST-thrombin-tagged human MDM2 (1 to 188) expressed in Escherichia coli assessed as inhibition of interaction with p53 in buffer ...
J Med Chem 57: 2963-88 (2014)
Article DOI: 10.1021/jm401911v
BindingDB Entry DOI: 10.7270/Q2862J0J
Cytochrome P450 3A4
(Homo sapiens (Human))
BDBM50008766
(CHEMBL3236654)
Show SMILES CC(C)(C)S(=O)(=O)C[C@H](C1CC1)N1[C@@H]([C@H](C[C@](C)(Cc2ncc(s2)C(=O)CO)C1=O)c1cccc(Cl)c1)c1ccc(Cl)cc1 |r|
Show InChI InChI=1S/C33H38Cl2N2O5S2/c1-32(2,3)44(41,42)19-26(20-8-9-20)37-30(21-10-12-23(34)13-11-21)25(22-6-5-7-24(35)14-22)15-33(4,31(37)40)16-29-36-17-28(43-29)27(39)18-38/h5-7,10-14,17,20,25-26,30,38H,8-9,15-16,18-19H2,1-4H3/t25-,26-,30-,33-/m1/s1
Reactome pathway
n/an/a 800n/an/an/an/an/an/a
Amgen Inc.
Curated by ChEMBL
Assay Description
Inhibition of CYP3A4 (unknown origin) using midazolam as substrate
J Med Chem 57: 2963-88 (2014)
Article DOI: 10.1021/jm401911v
BindingDB Entry DOI: 10.7270/Q2862J0J