BDBM50008812 CHEMBL3236659
SMILES: CC(C)(C)S(=O)(=O)C[C@H](C1CC1)N1[C@@H]([C@H](C[C@](C)(Cc2ncc(s2)C2(CC2)C(O)=O)C1=O)c1cccc(Cl)c1)c1ccc(Cl)cc1
InChI Key: InChIKey=HHQVGGDYUPWBRZ-ZVFFISPPSA-N
Data: 2 IC50
Activity Spreadsheet -- Enzyme Inhibition Constant Data from BindingDB
Found 2 hits for monomerid = 50008812
Trg + Lig
Ki
nM
ΔG°
kcal/mole
IC50
nM
Kd
nM
EC50/IC50
nM
koff
s-1
kon
M-1s-1
pHTemp
°C
E3 ubiquitin-protein ligase Mdm2
(Homo sapiens (Human))
BDBM50008812
(CHEMBL3236659)
Show SMILES CC(C)(C)S(=O)(=O)C[C@H](C1CC1)N1[C@@H]([C@H](C[C@](C)(Cc2ncc(s2)C2(CC2)C(O)=O)C1=O)c1cccc(Cl)c1)c1ccc(Cl)cc1 |r|
Show InChI InChI=1S/C35H40Cl2N2O5S2/c1-33(2,3)46(43,44)20-27(21-8-9-21)39-30(22-10-12-24(36)13-11-22)26(23-6-5-7-25(37)16-23)17-34(4,31(39)40)18-29-38-19-28(45-29)35(14-15-35)32(41)42/h5-7,10-13,16,19,21,26-27,30H,8-9,14-15,17-18,20H2,1-4H3,(H,41,42)/t26-,27-,30-,34-/m1/s1
NCI pathway
Reactome pathway
n/an/a 2.30n/an/an/an/an/an/a
Amgen Inc.
Curated by ChEMBL
Assay Description
Binding affinity to GST-thrombin-tagged human MDM2 (1 to 188) expressed in Escherichia coli assessed as inhibition of interaction with p53 in buffer ...
J Med Chem 57: 2963-88 (2014)
Article DOI: 10.1021/jm401911v
BindingDB Entry DOI: 10.7270/Q2862J0J
E3 ubiquitin-protein ligase Mdm2
(Homo sapiens (Human))
BDBM50008812
(CHEMBL3236659)
Show SMILES CC(C)(C)S(=O)(=O)C[C@H](C1CC1)N1[C@@H]([C@H](C[C@](C)(Cc2ncc(s2)C2(CC2)C(O)=O)C1=O)c1cccc(Cl)c1)c1ccc(Cl)cc1 |r|
Show InChI InChI=1S/C35H40Cl2N2O5S2/c1-33(2,3)46(43,44)20-27(21-8-9-21)39-30(22-10-12-24(36)13-11-22)26(23-6-5-7-25(37)16-23)17-34(4,31(39)40)18-29-38-19-28(45-29)35(14-15-35)32(41)42/h5-7,10-13,16,19,21,26-27,30H,8-9,14-15,17-18,20H2,1-4H3,(H,41,42)/t26-,27-,30-,34-/m1/s1
NCI pathway
Reactome pathway
n/an/a 0.200n/an/an/an/an/an/a
Amgen Inc.
Curated by ChEMBL
Assay Description
Binding affinity to GST-thrombin-tagged human MDM2 (1 to 188) expressed in Escherichia coli assessed as inhibition of interaction with p53 in serum f...
J Med Chem 57: 2963-88 (2014)
Article DOI: 10.1021/jm401911v
BindingDB Entry DOI: 10.7270/Q2862J0J