BDBM50008816 CHEMBL3236663
SMILES: CC(C)(C)S(=O)(=O)C[C@H](C1CC1)N1[C@@H]([C@H](C[C@](C)(Cc2nnc(CC(O)=O)[nH]2)C1=O)c1cccc(Cl)c1)c1ccc(Cl)cc1
InChI Key: InChIKey=SWESMVFNRHMZQJ-KKRKAPGZSA-N
Data: 2 IC50
Activity Spreadsheet -- Enzyme Inhibition Constant Data from BindingDB
Found 2 hits for monomerid = 50008816
Trg + Lig
Ki
nM
ΔG°
kcal/mole
IC50
nM
Kd
nM
EC50/IC50
nM
koff
s-1
kon
M-1s-1
pHTemp
°C
E3 ubiquitin-protein ligase Mdm2
(Homo sapiens (Human))
BDBM50008816
(CHEMBL3236663)
Show SMILES CC(C)(C)S(=O)(=O)C[C@H](C1CC1)N1[C@@H]([C@H](C[C@](C)(Cc2nnc(CC(O)=O)[nH]2)C1=O)c1cccc(Cl)c1)c1ccc(Cl)cc1 |r|
Show InChI InChI=1S/C32H38Cl2N4O5S/c1-31(2,3)44(42,43)18-25(19-8-9-19)38-29(20-10-12-22(33)13-11-20)24(21-6-5-7-23(34)14-21)16-32(4,30(38)41)17-27-35-26(36-37-27)15-28(39)40/h5-7,10-14,19,24-25,29H,8-9,15-18H2,1-4H3,(H,39,40)(H,35,36,37)/t24-,25-,29-,32-/m1/s1
NCI pathway
Reactome pathway
n/an/a 0.100n/an/an/an/an/an/a
Amgen Inc.
Curated by ChEMBL
Assay Description
Binding affinity to GST-thrombin-tagged human MDM2 (1 to 188) expressed in Escherichia coli assessed as inhibition of interaction with p53 in serum f...
J Med Chem 57: 2963-88 (2014)
Article DOI: 10.1021/jm401911v
BindingDB Entry DOI: 10.7270/Q2862J0J
E3 ubiquitin-protein ligase Mdm2
(Homo sapiens (Human))
BDBM50008816
(CHEMBL3236663)
Show SMILES CC(C)(C)S(=O)(=O)C[C@H](C1CC1)N1[C@@H]([C@H](C[C@](C)(Cc2nnc(CC(O)=O)[nH]2)C1=O)c1cccc(Cl)c1)c1ccc(Cl)cc1 |r|
Show InChI InChI=1S/C32H38Cl2N4O5S/c1-31(2,3)44(42,43)18-25(19-8-9-19)38-29(20-10-12-22(33)13-11-20)24(21-6-5-7-23(34)14-21)16-32(4,30(38)41)17-27-35-26(36-37-27)15-28(39)40/h5-7,10-14,19,24-25,29H,8-9,15-18H2,1-4H3,(H,39,40)(H,35,36,37)/t24-,25-,29-,32-/m1/s1
NCI pathway
Reactome pathway
n/an/a 1n/an/an/an/an/an/a
Amgen Inc.
Curated by ChEMBL
Assay Description
Binding affinity to GST-thrombin-tagged human MDM2 (1 to 188) expressed in Escherichia coli assessed as inhibition of interaction with p53 in buffer ...
J Med Chem 57: 2963-88 (2014)
Article DOI: 10.1021/jm401911v
BindingDB Entry DOI: 10.7270/Q2862J0J