BDBM50008821 CHEMBL3236666
SMILES: CC[C@@H](CS(=O)(=O)C(C)(C)C)N1[C@@H]([C@H](O[C@@H](CC(O)=O)C1=O)c1cccc(Cl)c1)c1ccc(Cl)cc1
InChI Key: InChIKey=UQONPZNBMIQADI-NEUULRRLSA-N
Data: 1 IC50
PDB links: 1 PDB ID matches this monomer.
Activity Spreadsheet -- Enzyme Inhibition Constant Data from BindingDB
Found 1 hit for monomerid = 50008821
Trg + Lig
Ki
nM
ΔG°
kcal/mole
IC50
nM
Kd
nM
EC50/IC50
nM
koff
s-1
kon
M-1s-1
pHTemp
°C
E3 ubiquitin-protein ligase Mdm2
(Homo sapiens (Human))
BDBM50008821
(CHEMBL3236666)
Show SMILES CC[C@@H](CS(=O)(=O)C(C)(C)C)N1[C@@H]([C@H](O[C@@H](CC(O)=O)C1=O)c1cccc(Cl)c1)c1ccc(Cl)cc1 |r|
Show InChI InChI=1S/C26H31Cl2NO6S/c1-5-20(15-36(33,34)26(2,3)4)29-23(16-9-11-18(27)12-10-16)24(17-7-6-8-19(28)13-17)35-21(25(29)32)14-22(30)31/h6-13,20-21,23-24H,5,14-15H2,1-4H3,(H,30,31)/t20-,21-,23+,24+/m0/s1
NCI pathway
Reactome pathway
n/an/a 9n/an/an/an/an/an/a
Amgen Inc.
Curated by ChEMBL
Assay Description
Binding affinity to GST-thrombin-tagged human MDM2 (1 to 188) expressed in Escherichia coli assessed as inhibition of interaction with p53 in serum f...
J Med Chem 57: 2963-88 (2014)
Article DOI: 10.1021/jm401911v
BindingDB Entry DOI: 10.7270/Q2862J0J
3D
3D Structure (crystal)