BDBM50008838 CHEMBL3236675
SMILES: Cc1cc(O)cc(C)c1C[C@H](N)C(=O)N[C@H](CCCNC(N)=N)C(=O)N[C@@H](Cc1cccc2ccccc12)C(=O)N[C@@H](CCCCN)C(O)=O
InChI Key: InChIKey=XOKJUHKHJMOTKH-JVVMDBNWSA-N
Data: 3 KI  2 IC50
Activity Spreadsheet -- Enzyme Inhibition Constant Data from BindingDB
Found 5 hits for monomerid = 50008838
Trg + Lig
Ki
nM
ΔG°
kcal/mole
IC50
nM
Kd
nM
EC50/IC50
nM
koff
s-1
kon
M-1s-1
pHTemp
°C
Mu-type opioid receptor
(Rattus norvegicus (rat))
BDBM50008838
(CHEMBL3236675)
Show SMILES Cc1cc(O)cc(C)c1C[C@H](N)C(=O)N[C@H](CCCNC(N)=N)C(=O)N[C@@H](Cc1cccc2ccccc12)C(=O)N[C@@H](CCCCN)C(O)=O |r|
Show InChI InChI=1S/C36H50N8O6/c1-21-17-25(45)18-22(2)27(21)20-28(38)32(46)42-29(14-8-16-41-36(39)40)33(47)44-31(34(48)43-30(35(49)50)13-5-6-15-37)19-24-11-7-10-23-9-3-4-12-26(23)24/h3-4,7,9-12,17-18,28-31,45H,5-6,8,13-16,19-20,37-38H2,1-2H3,(H,42,46)(H,43,48)(H,44,47)(H,49,50)(H4,39,40,41)/t28-,29+,30-,31-/m0/s1
Reactome pathway
0.109n/an/an/an/an/an/an/an/a
Nanjing Medical University
Curated by ChEMBL
Assay Description
Displacement of [3H]DAMGO from mu opioid receptor in rat brain membranes after 2 hrs
Bioorg Med Chem 22: 2333-8 (2014)
Article DOI: 10.1016/j.bmc.2014.02.011
BindingDB Entry DOI: 10.7270/Q20P11JG
Kappa-type opioid receptor
(Cavia porcellus (domestic guinea pig))
BDBM50008838
(CHEMBL3236675)
Show SMILES Cc1cc(O)cc(C)c1C[C@H](N)C(=O)N[C@H](CCCNC(N)=N)C(=O)N[C@@H](Cc1cccc2ccccc12)C(=O)N[C@@H](CCCCN)C(O)=O |r|
Show InChI InChI=1S/C36H50N8O6/c1-21-17-25(45)18-22(2)27(21)20-28(38)32(46)42-29(14-8-16-41-36(39)40)33(47)44-31(34(48)43-30(35(49)50)13-5-6-15-37)19-24-11-7-10-23-9-3-4-12-26(23)24/h3-4,7,9-12,17-18,28-31,45H,5-6,8,13-16,19-20,37-38H2,1-2H3,(H,42,46)(H,43,48)(H,44,47)(H,49,50)(H4,39,40,41)/t28-,29+,30-,31-/m0/s1
1.60n/an/an/an/an/an/an/an/a
Nanjing Medical University
Curated by ChEMBL
Assay Description
Displacement of [3H]U-69,593 from kappa opioid receptor in guinea pig brain membranes after 2 hrs
Bioorg Med Chem 22: 2333-8 (2014)
Article DOI: 10.1016/j.bmc.2014.02.011
BindingDB Entry DOI: 10.7270/Q20P11JG
Opioid receptors; mu & delta
(Rattus norvegicus (rat))
BDBM50008838
(CHEMBL3236675)
Show SMILES Cc1cc(O)cc(C)c1C[C@H](N)C(=O)N[C@H](CCCNC(N)=N)C(=O)N[C@@H](Cc1cccc2ccccc12)C(=O)N[C@@H](CCCCN)C(O)=O |r|
Show InChI InChI=1S/C36H50N8O6/c1-21-17-25(45)18-22(2)27(21)20-28(38)32(46)42-29(14-8-16-41-36(39)40)33(47)44-31(34(48)43-30(35(49)50)13-5-6-15-37)19-24-11-7-10-23-9-3-4-12-26(23)24/h3-4,7,9-12,17-18,28-31,45H,5-6,8,13-16,19-20,37-38H2,1-2H3,(H,42,46)(H,43,48)(H,44,47)(H,49,50)(H4,39,40,41)/t28-,29+,30-,31-/m0/s1
Reactome pathway
173n/an/an/an/an/an/an/an/a
Nanjing Medical University
Curated by ChEMBL
Assay Description
Displacement of [3H]DSLET from delta opioid receptor in rat brain membranes after 2 hrs
Bioorg Med Chem 22: 2333-8 (2014)
Article DOI: 10.1016/j.bmc.2014.02.011
BindingDB Entry DOI: 10.7270/Q20P11JG
Delta-type opioid receptor
(MOUSE)
BDBM50008838
(CHEMBL3236675)
Show SMILES Cc1cc(O)cc(C)c1C[C@H](N)C(=O)N[C@H](CCCNC(N)=N)C(=O)N[C@@H](Cc1cccc2ccccc12)C(=O)N[C@@H](CCCCN)C(O)=O |r|
Show InChI InChI=1S/C36H50N8O6/c1-21-17-25(45)18-22(2)27(21)20-28(38)32(46)42-29(14-8-16-41-36(39)40)33(47)44-31(34(48)43-30(35(49)50)13-5-6-15-37)19-24-11-7-10-23-9-3-4-12-26(23)24/h3-4,7,9-12,17-18,28-31,45H,5-6,8,13-16,19-20,37-38H2,1-2H3,(H,42,46)(H,43,48)(H,44,47)(H,49,50)(H4,39,40,41)/t28-,29+,30-,31-/m0/s1
Reactome pathway
n/an/a 0.755n/an/an/an/an/an/a
Nanjing Medical University
Curated by ChEMBL
Assay Description
Agonist activity at delta opioid receptor in mouse vas deferens assessed as inhibition of electrically-stimulated muscle contraction
Bioorg Med Chem 22: 2333-8 (2014)
Article DOI: 10.1016/j.bmc.2014.02.011
BindingDB Entry DOI: 10.7270/Q20P11JG
Mu-type opioid receptor
(GUINEA PIG)
BDBM50008838
(CHEMBL3236675)
Show SMILES Cc1cc(O)cc(C)c1C[C@H](N)C(=O)N[C@H](CCCNC(N)=N)C(=O)N[C@@H](Cc1cccc2ccccc12)C(=O)N[C@@H](CCCCN)C(O)=O |r|
Show InChI InChI=1S/C36H50N8O6/c1-21-17-25(45)18-22(2)27(21)20-28(38)32(46)42-29(14-8-16-41-36(39)40)33(47)44-31(34(48)43-30(35(49)50)13-5-6-15-37)19-24-11-7-10-23-9-3-4-12-26(23)24/h3-4,7,9-12,17-18,28-31,45H,5-6,8,13-16,19-20,37-38H2,1-2H3,(H,42,46)(H,43,48)(H,44,47)(H,49,50)(H4,39,40,41)/t28-,29+,30-,31-/m0/s1
n/an/a 1.90n/an/an/an/an/an/a
Nanjing Medical University
Curated by ChEMBL
Assay Description
Agonist activity at mu opioid receptor in guinea pig ileum assessed as inhibition of electrically-stimulated muscle contraction
Bioorg Med Chem 22: 2333-8 (2014)
Article DOI: 10.1016/j.bmc.2014.02.011
BindingDB Entry DOI: 10.7270/Q20P11JG