BDBM50008996 2-Thiazol-5-ylmethyl-1,2-dihydro-indazol-3-one::CHEMBL267524::CHEMBL3144715
SMILES: O=c1n(Cc2cncs2)[nH]c2ccccc12
InChI Key: InChIKey=KPXSUQVYEHMEMW-UHFFFAOYSA-N
Data: 2 IC50  1 EC50
Activity Spreadsheet -- Enzyme Inhibition Constant Data from BindingDB
Found 3 hits for monomerid = 50008996
Trg + Lig
Ki
nM
ΔG°
kcal/mole
IC50
nM
Kd
nM
EC50/IC50
nM
koff
s-1
kon
M-1s-1
pHTemp
°C
Arachidonate 5-lipoxygenase
(Rattus norvegicus)
BDBM50008996
(2-Thiazol-5-ylmethyl-1,2-dihydro-indazol-3-one | C...)
Show SMILES O=c1n(Cc2cncs2)[nH]c2ccccc12
Show InChI InChI=1S/C11H9N3OS/c15-11-9-3-1-2-4-10(9)13-14(11)6-8-5-12-7-16-8/h1-5,7,13H,6H2
n/an/a 1.80E+3n/an/an/an/an/an/a
ICI Pharma
Curated by ChEMBL
Assay Description
In vitro inhibition of LTB4 production was measured in rat blood
J Med Chem 34: 1028-36 (1991)
BindingDB Entry DOI: 10.7270/Q28G8MXH
Arachidonate 5-lipoxygenase
(Homo sapiens (Human))
BDBM50008996
(2-Thiazol-5-ylmethyl-1,2-dihydro-indazol-3-one | C...)
Show SMILES O=c1n(Cc2cncs2)[nH]c2ccccc12
Show InChI InChI=1S/C11H9N3OS/c15-11-9-3-1-2-4-10(9)13-14(11)6-8-5-12-7-16-8/h1-5,7,13H,6H2
Reactome pathway
n/an/an/an/a 5n/an/an/an/a
ICI Pharma
Curated by ChEMBL
Assay Description
Ex vivo inhibition of LTB4 production was measured in dog blood
J Med Chem 34: 1028-36 (1991)
BindingDB Entry DOI: 10.7270/Q28G8MXH
Cyclooxygenase
(RAT)
BDBM50008996
(2-Thiazol-5-ylmethyl-1,2-dihydro-indazol-3-one | C...)
Show SMILES O=c1n(Cc2cncs2)[nH]c2ccccc12
Show InChI InChI=1S/C11H9N3OS/c15-11-9-3-1-2-4-10(9)13-14(11)6-8-5-12-7-16-8/h1-5,7,13H,6H2
n/an/a>1.00E+5n/an/an/an/an/an/a
ICI Pharma
Curated by ChEMBL
Assay Description
In vitro inhibition of PGE-2 production was measured in rat blood
J Med Chem 34: 1028-36 (1991)
BindingDB Entry DOI: 10.7270/Q28G8MXH