BDBM50009010 2-Pyridin-2-ylmethyl-1,2-dihydro-indazol-3-one::CHEMBL3144580::CHEMBL8231
SMILES: O=c1n(Cc2ccccn2)[nH]c2ccccc12
InChI Key: InChIKey=NZOJCPNWISMMAJ-UHFFFAOYSA-N
Data: 2 IC50  1 EC50
Activity Spreadsheet -- Enzyme Inhibition Constant Data from BindingDB
Found 3 hits for monomerid = 50009010
Trg + Lig
Ki
nM
ΔG°
kcal/mole
IC50
nM
Kd
nM
EC50/IC50
nM
koff
s-1
kon
M-1s-1
pHTemp
°C
Arachidonate 5-lipoxygenase
(Rattus norvegicus)
BDBM50009010
(2-Pyridin-2-ylmethyl-1,2-dihydro-indazol-3-one | C...)
Show SMILES O=c1n(Cc2ccccn2)[nH]c2ccccc12
Show InChI InChI=1S/C13H11N3O/c17-13-11-6-1-2-7-12(11)15-16(13)9-10-5-3-4-8-14-10/h1-8,15H,9H2
n/an/a 3.10E+3n/an/an/an/an/an/a
ICI Pharma
Curated by ChEMBL
Assay Description
In vitro inhibition of LTB4 production was measured in rat blood
J Med Chem 34: 1028-36 (1991)
BindingDB Entry DOI: 10.7270/Q28G8MXH
Arachidonate 5-lipoxygenase
(Homo sapiens (Human))
BDBM50009010
(2-Pyridin-2-ylmethyl-1,2-dihydro-indazol-3-one | C...)
Show SMILES O=c1n(Cc2ccccn2)[nH]c2ccccc12
Show InChI InChI=1S/C13H11N3O/c17-13-11-6-1-2-7-12(11)15-16(13)9-10-5-3-4-8-14-10/h1-8,15H,9H2
Reactome pathway
n/an/an/an/a 30n/an/an/an/a
ICI Pharma
Curated by ChEMBL
Assay Description
Ex vivo inhibition of LTB4 production was measured in dog blood
J Med Chem 34: 1028-36 (1991)
BindingDB Entry DOI: 10.7270/Q28G8MXH
Cyclooxygenase
(RAT)
BDBM50009010
(2-Pyridin-2-ylmethyl-1,2-dihydro-indazol-3-one | C...)
Show SMILES O=c1n(Cc2ccccn2)[nH]c2ccccc12
Show InChI InChI=1S/C13H11N3O/c17-13-11-6-1-2-7-12(11)15-16(13)9-10-5-3-4-8-14-10/h1-8,15H,9H2
n/an/a 6.70E+4n/an/an/an/an/an/a
ICI Pharma
Curated by ChEMBL
Assay Description
In vitro inhibition of PGE-2 production was measured in rat blood
J Med Chem 34: 1028-36 (1991)
BindingDB Entry DOI: 10.7270/Q28G8MXH