BDBM50009239 CHEMBL4092125
SMILES: CN1CCc2ccccc2C1CNC(=O)c1ccc(Cl)c(Cl)c1
InChI Key: InChIKey=MJOXWVYKMFPFPL-ZWXJPGTLSA-N
Data: 1 KI  2 IC50  1 EC50
Activity Spreadsheet -- Enzyme Inhibition Constant Data from BindingDB
Found 4 hits for monomerid = 50009239
Trg + Lig
Ki
nM
ΔG°
kcal/mole
IC50
nM
Kd
nM
EC50/IC50
nM
koff
s-1
kon
M-1s-1
pHTemp
°C
Mu-type opioid receptor
(Homo sapiens (Human))
BDBM50009239
(CHEMBL4092125)
Show SMILES CN1CCc2ccccc2C1CNC(=O)c1ccc(Cl)c(Cl)c1
Show InChI InChI=1S/C42H68N8O11/c1-9-25(6)36(41(59)48-35(24(4)5)42(60)61-8)49-40(58)32-16-13-17-50(32)21-33(53)28(19-27-14-11-10-12-15-27)45-38(56)30(20-34(43)54)47-37(55)29(18-23(2)3)46-39(57)31(22-51)44-26(7)52/h10-12,14-15,23-25,28-33,35-36,51,53H,9,13,16-22H2,1-8H3,(H2,43,54)(H,44,52)(H,45,56)(H,46,57)(H,47,55)(H,48,59)(H,49,58)/t25-,28+,29-,30?,31-,32?,33+,35-,36-/m0/s1
NCI pathway
Reactome pathway
6.90n/an/an/an/an/an/an/an/a
National Health Research Institutes
Curated by ChEMBL
Assay Description
Displacement of [3H]naloxone from recombinant human MOR expressed in HEK cell membranes incubated for 60 mins
Eur J Med Chem 126: 202-217 (2017)
BindingDB Entry DOI: 10.7270/Q2RB76TS
Kappa-type opioid receptor
(Homo sapiens (Human))
BDBM50009239
(CHEMBL4092125)
Show SMILES CN1CCc2ccccc2C1CNC(=O)c1ccc(Cl)c(Cl)c1
Show InChI InChI=1S/C42H68N8O11/c1-9-25(6)36(41(59)48-35(24(4)5)42(60)61-8)49-40(58)32-16-13-17-50(32)21-33(53)28(19-27-14-11-10-12-15-27)45-38(56)30(20-34(43)54)47-37(55)29(18-23(2)3)46-39(57)31(22-51)44-26(7)52/h10-12,14-15,23-25,28-33,35-36,51,53H,9,13,16-22H2,1-8H3,(H2,43,54)(H,44,52)(H,45,56)(H,46,57)(H,47,55)(H,48,59)(H,49,58)/t25-,28+,29-,30?,31-,32?,33+,35-,36-/m0/s1
Reactome pathway
n/an/a 440n/an/an/an/an/an/a
National Health Research Institutes
Curated by ChEMBL
Assay Description
Agonist activity at human KOR expressed in HEK293 cells assessed as inhibition of forskolin-induced adenylyl cyclase-mediated cAMP accumulation after...
Eur J Med Chem 126: 202-217 (2017)
BindingDB Entry DOI: 10.7270/Q2RB76TS
Mu-type opioid receptor
(Homo sapiens (Human))
BDBM50009239
(CHEMBL4092125)
Show SMILES CN1CCc2ccccc2C1CNC(=O)c1ccc(Cl)c(Cl)c1
Show InChI InChI=1S/C42H68N8O11/c1-9-25(6)36(41(59)48-35(24(4)5)42(60)61-8)49-40(58)32-16-13-17-50(32)21-33(53)28(19-27-14-11-10-12-15-27)45-38(56)30(20-34(43)54)47-37(55)29(18-23(2)3)46-39(57)31(22-51)44-26(7)52/h10-12,14-15,23-25,28-33,35-36,51,53H,9,13,16-22H2,1-8H3,(H2,43,54)(H,44,52)(H,45,56)(H,46,57)(H,47,55)(H,48,59)(H,49,58)/t25-,28+,29-,30?,31-,32?,33+,35-,36-/m0/s1
NCI pathway
Reactome pathway
n/an/an/an/a 10n/an/an/an/a
National Health Research Institutes
Curated by ChEMBL
Assay Description
Agonist activity at human MOR expressed in CHO-K1 cells co-expressing Galpha 15 assessed as increase in intracellular calcium release incubated for 1...
Eur J Med Chem 126: 202-217 (2017)
BindingDB Entry DOI: 10.7270/Q2RB76TS
Mu-type opioid receptor
(Homo sapiens (Human))
BDBM50009239
(CHEMBL4092125)
Show SMILES CN1CCc2ccccc2C1CNC(=O)c1ccc(Cl)c(Cl)c1
Show InChI InChI=1S/C42H68N8O11/c1-9-25(6)36(41(59)48-35(24(4)5)42(60)61-8)49-40(58)32-16-13-17-50(32)21-33(53)28(19-27-14-11-10-12-15-27)45-38(56)30(20-34(43)54)47-37(55)29(18-23(2)3)46-39(57)31(22-51)44-26(7)52/h10-12,14-15,23-25,28-33,35-36,51,53H,9,13,16-22H2,1-8H3,(H2,43,54)(H,44,52)(H,45,56)(H,46,57)(H,47,55)(H,48,59)(H,49,58)/t25-,28+,29-,30?,31-,32?,33+,35-,36-/m0/s1
NCI pathway
Reactome pathway
n/an/a 50n/an/an/an/an/an/a
National Health Research Institutes
Curated by ChEMBL
Assay Description
Agonist activity at human MOR expressed in HEK293 cells assessed as inhibition of forskolin-induced adenylyl cyclase-mediated cAMP accumulation after...
Eur J Med Chem 126: 202-217 (2017)
BindingDB Entry DOI: 10.7270/Q2RB76TS