BDBM50009479 CHEMBL3234161
SMILES: CCCC(CO)NC(=O)[C@H](CCCC[N+](C)(C)C)NC(=O)[C@H](CC(C)C)NC(=O)[C@H](C)NC(=O)[C@H](Cc1ccccc1)NC(C)=O
InChI Key: InChIKey=LHBYWCDZJQIVPY-JQUNWGAISA-O
Data: 1 IC50
Activity Spreadsheet -- Enzyme Inhibition Constant Data from BindingDB
Found 1 hit for monomerid = 50009479
Trg + Lig
Ki
nM
ΔG°
kcal/mole
IC50
nM
Kd
nM
EC50/IC50
nM
koff
s-1
kon
M-1s-1
pHTemp
°C
Chromobox protein homolog 7
(Homo sapiens (Human))
BDBM50009479
(CHEMBL3234161)
Show SMILES CCCC(CO)NC(=O)[C@H](CCCC[N+](C)(C)C)NC(=O)[C@H](CC(C)C)NC(=O)[C@H](C)NC(=O)[C@H](Cc1ccccc1)NC(C)=O |r|
Show InChI InChI=1S/C34H58N6O6/c1-9-15-27(22-41)37-32(44)28(18-13-14-19-40(6,7)8)38-34(46)29(20-23(2)3)39-31(43)24(4)35-33(45)30(36-25(5)42)21-26-16-11-10-12-17-26/h10-12,16-17,23-24,27-30,41H,9,13-15,18-22H2,1-8H3,(H4-,35,36,37,38,39,42,43,44,45,46)/p+1/t24-,27?,28-,29-,30-/m0/s1
n/an/a>5.00E+5n/an/an/an/an/an/a
University of Victoria
Curated by ChEMBL
Assay Description
Displacement of FITC-labeled H3K27me3 from CBX7 (unknown origin) after 15 mins by fluorescence polarization assay
J Med Chem 57: 2874-83 (2014)
Article DOI: 10.1021/jm401487x
BindingDB Entry DOI: 10.7270/Q2571DJ3