BDBM50009517 CHEMBL3234435
SMILES: COC(=O)c1ccc(cc1)C(=O)N[C@@H](Cc1ccccc1)C(=O)N[C@@H](C)C(=O)N[C@@H](CC(C)C)C(=O)N[C@@H](CCCC[N+](C)(C)C)C(=O)N[C@@H](CO)C(N)=O
InChI Key: InChIKey=ROPDIILXQVFCKR-PKAIDYEGSA-O
Data: 1 IC50
Activity Spreadsheet -- Enzyme Inhibition Constant Data from BindingDB
Found 1 hit for monomerid = 50009517
Trg + Lig
Ki
nM
ΔG°
kcal/mole
IC50
nM
Kd
nM
EC50/IC50
nM
koff
s-1
kon
M-1s-1
pHTemp
°C
Chromobox protein homolog 7 (CBX7)
(Homo sapiens (Human))
BDBM50009517
(CHEMBL3234435)
Show SMILES COC(=O)c1ccc(cc1)C(=O)N[C@@H](Cc1ccccc1)C(=O)N[C@@H](C)C(=O)N[C@@H](CC(C)C)C(=O)N[C@@H](CCCC[N+](C)(C)C)C(=O)N[C@@H](CO)C(N)=O |r|
Show InChI InChI=1S/C39H57N7O9/c1-24(2)21-30(38(53)42-29(15-11-12-20-46(4,5)6)36(51)45-32(23-47)33(40)48)43-34(49)25(3)41-37(52)31(22-26-13-9-8-10-14-26)44-35(50)27-16-18-28(19-17-27)39(54)55-7/h8-10,13-14,16-19,24-25,29-32,47H,11-12,15,20-23H2,1-7H3,(H6-,40,41,42,43,44,45,48,49,50,51,52,53)/p+1/t25-,29-,30-,31-,32-/m0/s1
n/an/a 6.30E+3n/an/an/an/an/an/a
University of Victoria
Curated by ChEMBL
Assay Description
Displacement of FITC-labeled H3K27me3 from CBX7 (unknown origin) after 15 mins by fluorescence polarization assay
J Med Chem 57: 2874-83 (2014)
Article DOI: 10.1021/jm401487x
BindingDB Entry DOI: 10.7270/Q2571DJ3