BDBM50009543 2-{6-Amino-2-[2-(5,6,7,8-tetrahydro-naphthalen-2-yl)-ethylamino]-purin-9-yl}-5-hydroxymethyl-tetrahydro-furan-3,4-diol::CHEMBL2374391
SMILES: Nc1nc(NCCc2ccc3CCCCc3c2)nc2n(cnc12)[C@@H]1O[C@H](CO)[C@@H](O)[C@H]1O
InChI Key: InChIKey=UJJVTLKHMUVFEM-QTQZEZTPSA-N
Data: 2 IC50
Activity Spreadsheet -- Enzyme Inhibition Constant Data from BindingDB
Found 2 hits for monomerid = 50009543
Trg + Lig
Ki
nM
ΔG°
kcal/mole
IC50
nM
Kd
nM
EC50/IC50
nM
koff
s-1
kon
M-1s-1
pHTemp
°C
Adenosine A2 receptor
(Rattus norvegicus-Rattus norvegicus (rat))
BDBM50009543
(2-{6-Amino-2-[2-(5,6,7,8-tetrahydro-naphthalen-2-y...)
Show SMILES Nc1nc(NCCc2ccc3CCCCc3c2)nc2n(cnc12)[C@@H]1O[C@H](CO)[C@@H](O)[C@H]1O
Show InChI InChI=1S/C22H28N6O4/c23-19-16-20(28(11-25-16)21-18(31)17(30)15(10-29)32-21)27-22(26-19)24-8-7-12-5-6-13-3-1-2-4-14(13)9-12/h5-6,9,11,15,17-18,21,29-31H,1-4,7-8,10H2,(H3,23,24,26,27)/t15-,17-,18-,21-/m1/s1
n/an/a 17n/an/an/an/an/an/a
CIBA-GEIGY Corporation
Curated by ChEMBL
Assay Description
Concentration required for 50% inhibition of [3H]NECA binding on rat brain adenosine A2 receptor
J Med Chem 34: 2570-9 (1991)
BindingDB Entry DOI: 10.7270/Q2BZ66NN
Adenosine receptor A1
(Rattus norvegicus (rat))
BDBM50009543
(2-{6-Amino-2-[2-(5,6,7,8-tetrahydro-naphthalen-2-y...)
Show SMILES Nc1nc(NCCc2ccc3CCCCc3c2)nc2n(cnc12)[C@@H]1O[C@H](CO)[C@@H](O)[C@H]1O
Show InChI InChI=1S/C22H28N6O4/c23-19-16-20(28(11-25-16)21-18(31)17(30)15(10-29)32-21)27-22(26-19)24-8-7-12-5-6-13-3-1-2-4-14(13)9-12/h5-6,9,11,15,17-18,21,29-31H,1-4,7-8,10H2,(H3,23,24,26,27)/t15-,17-,18-,21-/m1/s1
Reactome pathway
n/an/a 692n/an/an/an/an/an/a
CIBA-GEIGY Corporation
Curated by ChEMBL
Assay Description
Concentration required for 50% inhibition of [3H]-CHA binding on rat brain adenosine A1 receptor
J Med Chem 34: 2570-9 (1991)
BindingDB Entry DOI: 10.7270/Q2BZ66NN