BDBM50009763 CHEMBL20024::[3-(4-Fluoro-benzothiazol-2-ylmethyl)-4-oxo-3,4-dihydro-phthalazin-1-yl]-acetic acid
SMILES: OC(=O)Cc1nn(Cc2nc3c(F)cccc3s2)c(=O)c2ccccc12
InChI Key: InChIKey=ZNXZWXYSOWLUIL-UHFFFAOYSA-N
Data: 1 IC50
Activity Spreadsheet -- Enzyme Inhibition Constant Data from BindingDB
Found 1 hit for monomerid = 50009763
Trg + Lig
Ki
nM
ΔG°
kcal/mole
IC50
nM
Kd
nM
EC50/IC50
nM
koff
s-1
kon
M-1s-1
pHTemp
°C
Aldose reductase (AR)
(Homo sapiens (Human))
BDBM50009763
(CHEMBL20024 | [3-(4-Fluoro-benzothiazol-2-ylmethyl...)
Show SMILES OC(=O)Cc1nn(Cc2nc3c(F)cccc3s2)c(=O)c2ccccc12
Show InChI InChI=1S/C18H12FN3O3S/c19-12-6-3-7-14-17(12)20-15(26-14)9-22-18(25)11-5-2-1-4-10(11)13(21-22)8-16(23)24/h1-7H,8-9H2,(H,23,24)
n/an/a 2n/an/an/an/an/an/a
Pfizer Inc.
Curated by ChEMBL
Assay Description
Inhibition of aldose reductase (aldo-keto reductase, AKR1B1) isolated from human placenta.
J Med Chem 34: 108-22 (1991)
BindingDB Entry DOI: 10.7270/Q2513X6H