BDBM50009774 CHEMBL20161::[3-(5,7-Dimethyl-benzothiazol-2-ylmethyl)-4-oxo-3,4-dihydro-phthalazin-1-yl]-acetic acid
SMILES: Cc1cc(C)c2sc(Cn3nc(CC(O)=O)c4ccccc4c3=O)nc2c1
InChI Key: InChIKey=VIVAMPKHBWEYAK-UHFFFAOYSA-N
Data: 1 IC50
Activity Spreadsheet -- Enzyme Inhibition Constant Data from BindingDB
Found 1 hit for monomerid = 50009774
Trg + Lig
Ki
nM
ΔG°
kcal/mole
IC50
nM
Kd
nM
EC50/IC50
nM
koff
s-1
kon
M-1s-1
pHTemp
°C
Aldose reductase (AR)
(Homo sapiens (Human))
BDBM50009774
(CHEMBL20161 | [3-(5,7-Dimethyl-benzothiazol-2-ylme...)
Show SMILES Cc1cc(C)c2sc(Cn3nc(CC(O)=O)c4ccccc4c3=O)nc2c1
Show InChI InChI=1S/C20H17N3O3S/c1-11-7-12(2)19-16(8-11)21-17(27-19)10-23-20(26)14-6-4-3-5-13(14)15(22-23)9-18(24)25/h3-8H,9-10H2,1-2H3,(H,24,25)
n/an/a 5.90n/an/an/an/an/an/a
Pfizer Inc.
Curated by ChEMBL
Assay Description
Inhibition of aldose reductase (aldo-keto reductase, AKR1B1) isolated from human placenta.
J Med Chem 34: 108-22 (1991)
BindingDB Entry DOI: 10.7270/Q2513X6H