BDBM50009854 CHEMBL13078::[1-(2-Morpholin-4-yl-ethyl)-1H-indol-3-yl]-naphthalen-1-yl-methanone
SMILES: O=C(c1cn(CCN2CCOCC2)c2ccccc12)c1cccc2ccccc12
InChI Key: InChIKey=SZWYXJHTNGJPKU-UHFFFAOYSA-N
Data: 4 KI  4 IC50  1 EC50
Activity Spreadsheet -- Enzyme Inhibition Constant Data from BindingDB
Found 9 hits for monomerid = 50009854
Trg + Lig
Ki
nM
ΔG°
kcal/mole
IC50
nM
Kd
nM
EC50/IC50
nM
koff
s-1
kon
M-1s-1
pHTemp
°C
Cannabinoid receptor 1
(Homo sapiens (Human))
BDBM50009854
(CHEMBL13078 | [1-(2-Morpholin-4-yl-ethyl)-1H-indol...)
Show SMILES O=C(c1cn(CCN2CCOCC2)c2ccccc12)c1cccc2ccccc12
Show InChI InChI=1S/C25H24N2O2/c28-25(22-10-5-7-19-6-1-2-8-20(19)22)23-18-27(24-11-4-3-9-21(23)24)13-12-26-14-16-29-17-15-26/h1-11,18H,12-17H2
NCI pathway
Reactome pathway
82n/an/an/an/an/an/an/an/a
Research Triangle Institute
Curated by ChEMBL
Assay Description
Displacement of [3H]-CP55940 from human CB1 receptor
J Med Chem 59: 7525-43 (2016)
Article DOI: 10.1021/acs.jmedchem.6b00516
Cannabinoid receptor
(Rattus norvegicus (rat))
BDBM50009854
(CHEMBL13078 | [1-(2-Morpholin-4-yl-ethyl)-1H-indol...)
Show SMILES O=C(c1cn(CCN2CCOCC2)c2ccccc12)c1cccc2ccccc12
Show InChI InChI=1S/C25H24N2O2/c28-25(22-10-5-7-19-6-1-2-8-20(19)22)23-18-27(24-11-4-3-9-21(23)24)13-12-26-14-16-29-17-15-26/h1-11,18H,12-17H2
Reactome pathway
2.09E+7n/an/an/an/an/an/an/an/a
Sanofi Research Division
Curated by ChEMBL
Assay Description
Displacement of [3H]CP-55940 from Cannabinoid receptor 1 of rat forebrain membranes
J Med Chem 41: 4521-32 (1998)
Article DOI: 10.1021/jm980305c
BindingDB Entry DOI: 10.7270/Q2XD14F0
Cannabinoid receptor
(Rattus norvegicus (rat))
BDBM50009854
(CHEMBL13078 | [1-(2-Morpholin-4-yl-ethyl)-1H-indol...)
Show SMILES O=C(c1cn(CCN2CCOCC2)c2ccccc12)c1cccc2ccccc12
Show InChI InChI=1S/C25H24N2O2/c28-25(22-10-5-7-19-6-1-2-8-20(19)22)23-18-27(24-11-4-3-9-21(23)24)13-12-26-14-16-29-17-15-26/h1-11,18H,12-17H2
Reactome pathway
1.66E+8n/an/an/an/an/an/an/an/a
Institute of Bioorganic & Petroleum Chemistry
Curated by ChEMBL
Assay Description
Binding affinity at cannabinoid receptor 1 using rat brain membranes
J Med Chem 44: 2411-20 (2001)
Article DOI: 10.1021/jm010858e
BindingDB Entry DOI: 10.7270/Q2GT5QXX
Cannabinoid receptor
(Rattus norvegicus (rat))
BDBM50009854
(CHEMBL13078 | [1-(2-Morpholin-4-yl-ethyl)-1H-indol...)
Show SMILES O=C(c1cn(CCN2CCOCC2)c2ccccc12)c1cccc2ccccc12
Show InChI InChI=1S/C25H24N2O2/c28-25(22-10-5-7-19-6-1-2-8-20(19)22)23-18-27(24-11-4-3-9-21(23)24)13-12-26-14-16-29-17-15-26/h1-11,18H,12-17H2
Reactome pathway
1.66E+8n/an/an/an/an/an/an/an/a
Sanofi Research Division
Curated by ChEMBL
Assay Description
Cannabinoid receptor 1 binding affinity by measuring its ability to displace [3H]WIN-55212-2 in rat forebrain membranes
J Med Chem 41: 4521-32 (1998)
Article DOI: 10.1021/jm980305c
BindingDB Entry DOI: 10.7270/Q2XD14F0
Cannabinoid receptor
(Rattus norvegicus (Rat)-Rattus norvegicus (rat))
BDBM50009854
(CHEMBL13078 | [1-(2-Morpholin-4-yl-ethyl)-1H-indol...)
Show SMILES O=C(c1cn(CCN2CCOCC2)c2ccccc12)c1cccc2ccccc12
Show InChI InChI=1S/C25H24N2O2/c28-25(22-10-5-7-19-6-1-2-8-20(19)22)23-18-27(24-11-4-3-9-21(23)24)13-12-26-14-16-29-17-15-26/h1-11,18H,12-17H2
n/an/a 7.80n/an/an/an/an/an/a
TBA
Assay Description
Inhibition of Vascular endothelial growth factor receptor 2 (KDR)
Citation and Details
BindingDB Entry DOI: 10.7270/Q2KD213J
Cannabinoid receptor 1
(Rattus norvegicus (rat))
BDBM50009854
(CHEMBL13078 | [1-(2-Morpholin-4-yl-ethyl)-1H-indol...)
Show SMILES O=C(c1cn(CCN2CCOCC2)c2ccccc12)c1cccc2ccccc12
Show InChI InChI=1S/C25H24N2O2/c28-25(22-10-5-7-19-6-1-2-8-20(19)22)23-18-27(24-11-4-3-9-21(23)24)13-12-26-14-16-29-17-15-26/h1-11,18H,12-17H2
Reactome pathway
n/an/a 46n/an/an/an/an/an/a
National Institute of Diabetes and Digestive and Kidney Diseases
Curated by ChEMBL
Assay Description
Binding affinity against brain cannabinoid receptor 1 using [3H]-CP-55,940 as radioligand at 0.25 nM concentration
J Med Chem 39: 1967-74 (1996)
Article DOI: 10.1021/jm950932r
BindingDB Entry DOI: 10.7270/Q27M071B
Adenylate cyclase type V
(Rattus norvegicus)
BDBM50009854
(CHEMBL13078 | [1-(2-Morpholin-4-yl-ethyl)-1H-indol...)
Show SMILES O=C(c1cn(CCN2CCOCC2)c2ccccc12)c1cccc2ccccc12
Show InChI InChI=1S/C25H24N2O2/c28-25(22-10-5-7-19-6-1-2-8-20(19)22)23-18-27(24-11-4-3-9-21(23)24)13-12-26-14-16-29-17-15-26/h1-11,18H,12-17H2
Reactome pathway
n/an/an/an/a 275n/an/an/an/a
National Institute of Diabetes and Digestive and Kidney Diseases
Curated by ChEMBL
Assay Description
Compound was evaluated for inhibition of hormone stimulated Adenylate cyclase activity in N18TG2 membranes.
J Med Chem 39: 1967-74 (1996)
Article DOI: 10.1021/jm950932r
BindingDB Entry DOI: 10.7270/Q27M071B
Cannabinoid receptor 1
(Rattus norvegicus (rat))
BDBM50009854
(CHEMBL13078 | [1-(2-Morpholin-4-yl-ethyl)-1H-indol...)
Show SMILES O=C(c1cn(CCN2CCOCC2)c2ccccc12)c1cccc2ccccc12
Show InChI InChI=1S/C25H24N2O2/c28-25(22-10-5-7-19-6-1-2-8-20(19)22)23-18-27(24-11-4-3-9-21(23)24)13-12-26-14-16-29-17-15-26/h1-11,18H,12-17H2
Reactome pathway
n/an/a 7.80n/an/an/an/an/an/a
Sanofi Research Division
Curated by ChEMBL
Assay Description
Concentration of compound required to inhibit 50% of [3H]-WIN- 55212 binding to Cannabinoid receptor 1 in rat cerebellum membranes.
J Med Chem 38: 3094-105 (1995)
BindingDB Entry DOI: 10.7270/Q2DN442Z
Prostaglandin-H2 D-isomerase
(Mus musculus)
BDBM50009854
(CHEMBL13078 | [1-(2-Morpholin-4-yl-ethyl)-1H-indol...)
Show SMILES O=C(c1cn(CCN2CCOCC2)c2ccccc12)c1cccc2ccccc12
Show InChI InChI=1S/C25H24N2O2/c28-25(22-10-5-7-19-6-1-2-8-20(19)22)23-18-27(24-11-4-3-9-21(23)24)13-12-26-14-16-29-17-15-26/h1-11,18H,12-17H2
Reactome pathway
n/an/a 6n/an/an/an/an/an/a
Sterling Research Group
Curated by ChEMBL
Assay Description
Concentration required to inhibit 50% activity of prostaglandin synthetase was determined in vitro in mouse brain microsomes
J Med Chem 34: 1099-110 (1991)
BindingDB Entry DOI: 10.7270/Q24M955S