BDBM50009955 1-(4-Chloro-phenyl)-4-(2-methoxy-ethyl)-pyrazolidin-3-one::CHEMBL41528
SMILES: COCCC1CN(NC1=O)c1ccc(Cl)cc1
InChI Key: InChIKey=YTDFAGFROZMYPO-UHFFFAOYSA-N
Data: 1 IC50
Activity Spreadsheet -- Enzyme Inhibition Constant Data from BindingDB
Found 1 hit for monomerid = 50009955
Trg + Lig
Ki
nM
ΔG°
kcal/mole
IC50
nM
Kd
nM
EC50/IC50
nM
koff
s-1
kon
M-1s-1
pHTemp
°C
Arachidonate 5-lipoxygenase
(Rattus norvegicus)
BDBM50009955
(1-(4-Chloro-phenyl)-4-(2-methoxy-ethyl)-pyrazolidi...)
Show SMILES COCCC1CN(NC1=O)c1ccc(Cl)cc1
Show InChI InChI=1S/C12H15ClN2O2/c1-17-7-6-9-8-15(14-12(9)16)11-4-2-10(13)3-5-11/h2-5,9H,6-8H2,1H3,(H,14,16)
n/an/a 250n/an/an/an/an/an/a
Sterling Research Group
Curated by ChEMBL
Assay Description
In vitro inhibition of rat 5-Lipoxygenase
J Med Chem 34: 1560-70 (1991)
BindingDB Entry DOI: 10.7270/Q2RV0MPG