BDBM50010360 CHEMBL3263603
SMILES: CCNC(=O)Nc1nc2cc(-c3ccc(F)nc3)c(OCC3CCOC3)nc2s1
InChI Key: InChIKey=UXHVCGLLMWOEDM-UHFFFAOYSA-N
Data: 1 IC50
Activity Spreadsheet -- Enzyme Inhibition Constant Data from BindingDB
Found 1 hit for monomerid = 50010360
Trg + Lig
Ki
nM
ΔG°
kcal/mole
IC50
nM
Kd
nM
EC50/IC50
nM
koff
s-1
kon
M-1s-1
pHTemp
°C
DNA gyrase subunit B
(Mycobacterium smegmatis)
BDBM50010360
(CHEMBL3263603)
Show SMILES CCNC(=O)Nc1nc2cc(-c3ccc(F)nc3)c(OCC3CCOC3)nc2s1
Show InChI InChI=1S/C19H20FN5O3S/c1-2-21-18(26)25-19-23-14-7-13(12-3-4-15(20)22-8-12)16(24-17(14)29-19)28-10-11-5-6-27-9-11/h3-4,7-8,11H,2,5-6,9-10H2,1H3,(H2,21,23,25,26)
n/an/a 9n/an/an/an/an/an/a
AstraZeneca India Pvt. Ltd.
Curated by ChEMBL
Assay Description
Inhibition of Mycobacterium smegmatis DNA gyrase B ATPase activity assessed as inorganic phosphate release using ATP as substrate by colorimetric ana...
Cell Chem Biol 56: 8834-48 (2013)
Article DOI: 10.1021/jm401268f
BindingDB Entry DOI: 10.7270/Q2RV0Q7W