BDBM50010365 CHEMBL3263607
SMILES: CCNC(=O)Nc1nc2cc(-c3cnc(C)nc3)c(OCC3CCOC3)nc2s1
InChI Key: InChIKey=FVWSCKNJICVDQN-UHFFFAOYSA-N
Data: 1 IC50
Activity Spreadsheet -- Enzyme Inhibition Constant Data from BindingDB
Found 1 hit for monomerid = 50010365
Trg + Lig
Ki
nM
ΔG°
kcal/mole
IC50
nM
Kd
nM
EC50/IC50
nM
koff
s-1
kon
M-1s-1
pHTemp
°C
DNA gyrase subunit B
(Mycobacterium smegmatis)
BDBM50010365
(CHEMBL3263607)
Show SMILES CCNC(=O)Nc1nc2cc(-c3cnc(C)nc3)c(OCC3CCOC3)nc2s1
Show InChI InChI=1S/C19H22N6O3S/c1-3-20-18(26)25-19-23-15-6-14(13-7-21-11(2)22-8-13)16(24-17(15)29-19)28-10-12-4-5-27-9-12/h6-8,12H,3-5,9-10H2,1-2H3,(H2,20,23,25,26)
n/an/a 7n/an/an/an/an/an/a
AstraZeneca India Pvt. Ltd.
Curated by ChEMBL
Assay Description
Inhibition of Mycobacterium smegmatis DNA gyrase B ATPase activity assessed as inorganic phosphate release using ATP as substrate by colorimetric ana...
Cell Chem Biol 56: 8834-48 (2013)
Article DOI: 10.1021/jm401268f
BindingDB Entry DOI: 10.7270/Q2RV0Q7W