null
SMILES: CCNC(=O)Nc1nc2cc(-c3cc(C(C)C)n(C)c(=O)c3)c(OCC3CCOC3)nc2s1
InChI Key: InChIKey=JYZIAACRFMAANE-UHFFFAOYSA-N
Activity Spreadsheet -- Enzyme Inhibition Constant Data from BindingDB
Found 1 hit for monomerid = 50010375
Trg + Lig
Ki
nM
ΔG°
kcal/mole
IC50
nM
Kd
nM
EC50/IC50
nM
koff
s-1
kon
M-1s-1
pHTemp
°C
DNA gyrase subunit B
(Mycobacterium smegmatis)
BDBM50010375
(CHEMBL3263617)
Show SMILES CCNC(=O)Nc1nc2cc(-c3cc(C(C)C)n(C)c(=O)c3)c(OCC3CCOC3)nc2s1
Show InChI InChI=1S/C23H29N5O4S/c1-5-24-22(30)27-23-25-17-10-16(15-8-18(13(2)3)28(4)19(29)9-15)20(26-21(17)33-23)32-12-14-6-7-31-11-14/h8-10,13-14H,5-7,11-12H2,1-4H3,(H2,24,25,27,30)
n/an/a 8n/an/an/an/an/an/a
AstraZeneca India Pvt. Ltd.
Curated by ChEMBL
Assay Description
Inhibition of Mycobacterium smegmatis DNA gyrase B ATPase activity assessed as inorganic phosphate release using ATP as substrate by colorimetric ana...
Cell Chem Biol 56: 8834-48 (2013)
Article DOI: 10.1021/jm401268f
BindingDB Entry DOI: 10.7270/Q2RV0Q7W