BDBM50010383 CHEMBL3263959
SMILES: COc1cc2c(Oc3ccc(NC(=O)c4c(C)n(C)n(-c5ccccc5)c4=O)cc3F)ccnc2cc1OCCCN1CCN(C)CC1
InChI Key: InChIKey=WQROZMCEHXFGBY-UHFFFAOYSA-N
Data: 3 IC50
Activity Spreadsheet -- Enzyme Inhibition Constant Data from BindingDB
Found 3 hits for monomerid = 50010383
Trg + Lig
Ki
nM
ΔG°
kcal/mole
IC50
nM
Kd
nM
EC50/IC50
nM
koff
s-1
kon
M-1s-1
pHTemp
°C
Epidermal growth factor receptor
(Homo sapiens (Human))
BDBM50010383
(CHEMBL3263959)
Show SMILES COc1cc2c(Oc3ccc(NC(=O)c4c(C)n(C)n(-c5ccccc5)c4=O)cc3F)ccnc2cc1OCCCN1CCN(C)CC1
Show InChI InChI=1S/C36H39FN6O5/c1-24-34(36(45)43(41(24)3)26-9-6-5-7-10-26)35(44)39-25-11-12-31(28(37)21-25)48-30-13-14-38-29-23-33(32(46-4)22-27(29)30)47-20-8-15-42-18-16-40(2)17-19-42/h5-7,9-14,21-23H,8,15-20H2,1-4H3,(H,39,44)
n/an/a 7.67E+3n/an/an/an/an/an/a
Vichem Chemie Research Ltd.
Curated by ChEMBL
Assay Description
Inhibition of recombinant EGFR (unknown origin) using poly-GT peptide as substrate by Transcreener assay
ACS Med Chem Lett 5: 298-303 (2014)
Article DOI: 10.1021/ml4003309
BindingDB Entry DOI: 10.7270/Q2HD7X6X
Insulin receptor
(Homo sapiens (Human))
BDBM50010383
(CHEMBL3263959)
Show SMILES COc1cc2c(Oc3ccc(NC(=O)c4c(C)n(C)n(-c5ccccc5)c4=O)cc3F)ccnc2cc1OCCCN1CCN(C)CC1
Show InChI InChI=1S/C36H39FN6O5/c1-24-34(36(45)43(41(24)3)26-9-6-5-7-10-26)35(44)39-25-11-12-31(28(37)21-25)48-30-13-14-38-29-23-33(32(46-4)22-27(29)30)47-20-8-15-42-18-16-40(2)17-19-42/h5-7,9-14,21-23H,8,15-20H2,1-4H3,(H,39,44)
n/an/a 39n/an/an/an/an/an/a
Vichem Chemie Research Ltd.
Curated by ChEMBL
Assay Description
Inhibition of recombinant INSR (unknown origin) using fluorescent dye-labelled KKSRGDYMTMQIG peptide peptide as substrate after 1 hr by IMAP assay
ACS Med Chem Lett 5: 298-303 (2014)
Article DOI: 10.1021/ml4003309
BindingDB Entry DOI: 10.7270/Q2HD7X6X
Hepatocyte growth factor receptor
(Homo sapiens (Human))
BDBM50010383
(CHEMBL3263959)
Show SMILES COc1cc2c(Oc3ccc(NC(=O)c4c(C)n(C)n(-c5ccccc5)c4=O)cc3F)ccnc2cc1OCCCN1CCN(C)CC1
Show InChI InChI=1S/C36H39FN6O5/c1-24-34(36(45)43(41(24)3)26-9-6-5-7-10-26)35(44)39-25-11-12-31(28(37)21-25)48-30-13-14-38-29-23-33(32(46-4)22-27(29)30)47-20-8-15-42-18-16-40(2)17-19-42/h5-7,9-14,21-23H,8,15-20H2,1-4H3,(H,39,44)
n/an/a 5n/an/an/an/an/an/a
Vichem Chemie Research Ltd.
Curated by ChEMBL
Assay Description
Inhibition of recombinant c-MET (unknown origin) using poly-AEKY peptide as substrate after 60 mins by ADPGlo assay
ACS Med Chem Lett 5: 298-303 (2014)
Article DOI: 10.1021/ml4003309
BindingDB Entry DOI: 10.7270/Q2HD7X6X