null
SMILES: Cc1cc(O)cc(C)c1C[C@H](N)C(=O)N[C@H](CCCNC(N)=N)C(=O)N[C@@H](Cc1ccccc1)C(=O)N[C@@H](Cc1cn(nn1)[C@@H]1O[C@H](CO)[C@H](O)[C@H](O)[C@H]1O)C(N)=O
InChI Key: InChIKey=BNCUONHDNJHYQU-BXETYFKASA-N
Activity Spreadsheet -- Enzyme Inhibition Constant Data from BindingDB
Found 4 hits for monomerid = 50010486
Trg + Lig
Ki
nM
ΔG°
kcal/mole
IC50
nM
Kd
nM
EC50/IC50
nM
koff
s-1
kon
M-1s-1
pHTemp
°C
Mu-type opioid receptor
(Rattus norvegicus (rat))
BDBM50010486
(CHEMBL3264359)
Show SMILES Cc1cc(O)cc(C)c1C[C@H](N)C(=O)N[C@H](CCCNC(N)=N)C(=O)N[C@@H](Cc1ccccc1)C(=O)N[C@@H](Cc1cn(nn1)[C@@H]1O[C@H](CO)[C@H](O)[C@H](O)[C@H]1O)C(N)=O |r|
Show InChI InChI=1S/C37H53N11O10/c1-18-11-22(50)12-19(2)23(18)15-24(38)33(55)43-25(9-6-10-42-37(40)41)34(56)45-27(13-20-7-4-3-5-8-20)35(57)44-26(32(39)54)14-21-16-48(47-46-21)36-31(53)30(52)29(51)28(17-49)58-36/h3-5,7-8,11-12,16,24-31,36,49-53H,6,9-10,13-15,17,38H2,1-2H3,(H2,39,54)(H,43,55)(H,44,57)(H,45,56)(H4,40,41,42)/t24-,25+,26-,27-,28+,29-,30-,31+,36+/m0/s1
Reactome pathway
0.222n/an/an/an/an/an/an/an/a
Vrije Universiteit Brussel
Curated by ChEMBL
Assay Description
Displacement of [3H]DAMGO from mu opioid receptor in rat brain membranes
ACS Med Chem Lett 5: 352-357 (2014)
Article DOI: 10.1021/ml4004765
BindingDB Entry DOI: 10.7270/Q2VM4DSC
Delta-type opioid receptor
(Rattus norvegicus (rat))
BDBM50010486
(CHEMBL3264359)
Show SMILES Cc1cc(O)cc(C)c1C[C@H](N)C(=O)N[C@H](CCCNC(N)=N)C(=O)N[C@@H](Cc1ccccc1)C(=O)N[C@@H](Cc1cn(nn1)[C@@H]1O[C@H](CO)[C@H](O)[C@H](O)[C@H]1O)C(N)=O |r|
Show InChI InChI=1S/C37H53N11O10/c1-18-11-22(50)12-19(2)23(18)15-24(38)33(55)43-25(9-6-10-42-37(40)41)34(56)45-27(13-20-7-4-3-5-8-20)35(57)44-26(32(39)54)14-21-16-48(47-46-21)36-31(53)30(52)29(51)28(17-49)58-36/h3-5,7-8,11-12,16,24-31,36,49-53H,6,9-10,13-15,17,38H2,1-2H3,(H2,39,54)(H,43,55)(H,44,57)(H,45,56)(H4,40,41,42)/t24-,25+,26-,27-,28+,29-,30-,31+,36+/m0/s1
Reactome pathway
16n/an/an/an/an/an/an/an/a
Vrije Universiteit Brussel
Curated by ChEMBL
Assay Description
Displacement of [3H]DSLET from delta opioid receptor in rat brain membranes
ACS Med Chem Lett 5: 352-357 (2014)
Article DOI: 10.1021/ml4004765
BindingDB Entry DOI: 10.7270/Q2VM4DSC
Mu-type opioid receptor
(GUINEA PIG)
BDBM50010486
(CHEMBL3264359)
Show SMILES Cc1cc(O)cc(C)c1C[C@H](N)C(=O)N[C@H](CCCNC(N)=N)C(=O)N[C@@H](Cc1ccccc1)C(=O)N[C@@H](Cc1cn(nn1)[C@@H]1O[C@H](CO)[C@H](O)[C@H](O)[C@H]1O)C(N)=O |r|
Show InChI InChI=1S/C37H53N11O10/c1-18-11-22(50)12-19(2)23(18)15-24(38)33(55)43-25(9-6-10-42-37(40)41)34(56)45-27(13-20-7-4-3-5-8-20)35(57)44-26(32(39)54)14-21-16-48(47-46-21)36-31(53)30(52)29(51)28(17-49)58-36/h3-5,7-8,11-12,16,24-31,36,49-53H,6,9-10,13-15,17,38H2,1-2H3,(H2,39,54)(H,43,55)(H,44,57)(H,45,56)(H4,40,41,42)/t24-,25+,26-,27-,28+,29-,30-,31+,36+/m0/s1
n/an/a 0.660n/an/an/an/an/an/a
Vrije Universiteit Brussel
Curated by ChEMBL
Assay Description
Agonist activity at mu opioid receptor in guinea pig ileum
ACS Med Chem Lett 5: 352-357 (2014)
Article DOI: 10.1021/ml4004765
BindingDB Entry DOI: 10.7270/Q2VM4DSC
Delta-type opioid receptor
(MOUSE)
BDBM50010486
(CHEMBL3264359)
Show SMILES Cc1cc(O)cc(C)c1C[C@H](N)C(=O)N[C@H](CCCNC(N)=N)C(=O)N[C@@H](Cc1ccccc1)C(=O)N[C@@H](Cc1cn(nn1)[C@@H]1O[C@H](CO)[C@H](O)[C@H](O)[C@H]1O)C(N)=O |r|
Show InChI InChI=1S/C37H53N11O10/c1-18-11-22(50)12-19(2)23(18)15-24(38)33(55)43-25(9-6-10-42-37(40)41)34(56)45-27(13-20-7-4-3-5-8-20)35(57)44-26(32(39)54)14-21-16-48(47-46-21)36-31(53)30(52)29(51)28(17-49)58-36/h3-5,7-8,11-12,16,24-31,36,49-53H,6,9-10,13-15,17,38H2,1-2H3,(H2,39,54)(H,43,55)(H,44,57)(H,45,56)(H4,40,41,42)/t24-,25+,26-,27-,28+,29-,30-,31+,36+/m0/s1
Reactome pathway
n/an/a 2n/an/an/an/an/an/a
Vrije Universiteit Brussel
Curated by ChEMBL
Assay Description
Agonist activity at delta opioid receptor in mouse vas deferens
ACS Med Chem Lett 5: 352-357 (2014)
Article DOI: 10.1021/ml4004765
BindingDB Entry DOI: 10.7270/Q2VM4DSC