BDBM50010499 CHEMBL3264363
SMILES: O=C(NCCN1CCN(CC1)c1ccccc1)c1cnc2ccccc2n1
InChI Key: InChIKey=UADJVJWTYUDZLK-UHFFFAOYSA-N
Data: 1 KI  1 IC50
Activity Spreadsheet -- Enzyme Inhibition Constant Data from BindingDB
Found 2 hits for monomerid = 50010499
Trg + Lig
Ki
nM
ΔG°
kcal/mole
IC50
nM
Kd
nM
EC50/IC50
nM
koff
s-1
kon
M-1s-1
pHTemp
°C
5-hydroxytryptamine receptor 1A
(Homo sapiens (Human))
BDBM50010499
(CHEMBL3264363)
Show SMILES O=C(NCCN1CCN(CC1)c1ccccc1)c1cnc2ccccc2n1
Show InChI InChI=1S/C21H23N5O/c27-21(20-16-23-18-8-4-5-9-19(18)24-20)22-10-11-25-12-14-26(15-13-25)17-6-2-1-3-7-17/h1-9,16H,10-15H2,(H,22,27)
30n/an/an/an/an/an/an/an/a
University of Li£ge
Curated by ChEMBL
Assay Description
Displacement of [3H]-8-OH-OPAT from human recombinant 5HT1A receptor expressed in CHO cells after 60 mins by liquid scintillation counting analysis
ACS Med Chem Lett 5: 358-62 (2014)
Article DOI: 10.1021/ml4004843
BindingDB Entry DOI: 10.7270/Q2QZ2CHT
5-hydroxytryptamine receptor 1A
(Rattus norvegicus (rat))
BDBM50010499
(CHEMBL3264363)
Show SMILES O=C(NCCN1CCN(CC1)c1ccccc1)c1cnc2ccccc2n1
Show InChI InChI=1S/C21H23N5O/c27-21(20-16-23-18-8-4-5-9-19(18)24-20)22-10-11-25-12-14-26(15-13-25)17-6-2-1-3-7-17/h1-9,16H,10-15H2,(H,22,27)
n/an/a 1.68E+3n/an/an/an/an/an/a
University of Li£ge
Curated by ChEMBL
Assay Description
Agonist activity at Wistar rat brain 5HT1A receptor assessed as inhibition of firing rate of dorsal raphe nucleus by electrophysiological analysis
ACS Med Chem Lett 5: 358-62 (2014)
Article DOI: 10.1021/ml4004843
BindingDB Entry DOI: 10.7270/Q2QZ2CHT