null
SMILES: CC1(C)C2CCC1(C)C(C2)N=C(N)Nc1ccccc1I
InChI Key: InChIKey=IHGPGLBRYYVGAG-UHFFFAOYSA-N
Activity Spreadsheet -- Enzyme Inhibition Constant Data from BindingDB
Found 1 hit for monomerid = 50010735
Trg + Lig
Ki
nM
ΔG°
kcal/mole
IC50
nM
Kd
nM
EC50/IC50
nM
koff
s-1
kon
M-1s-1
pHTemp
°C
Sigma non-opioid intracellular receptor 1
(Homo sapiens (Human))
BDBM50010735
(CHEMBL553817 | N-(2-Iodo-phenyl)-N'-(1,7,7-trimeth...)
Show SMILES CC1(C)C2CCC1(C)C(C2)N=C(N)Nc1ccccc1I |w:10.11,TEB:10:8:1:5.4|
Show InChI InChI=1S/C17H24IN3/c1-16(2)11-8-9-17(16,3)14(10-11)21-15(19)20-13-7-5-4-6-12(13)18/h4-7,11,14H,8-10H2,1-3H3,(H3,19,20,21)
n/an/a 18n/an/an/an/an/an/a
University of Oregon
Curated by ChEMBL
Assay Description
In vitro inhibitory activity against [3H]DTG binding to Sigma opioid receptor in guinea pig brain membrane homogenates
J Med Chem 33: 2421-9 (1990)
BindingDB Entry DOI: 10.7270/Q25Q4WQ3