BDBM50011006 CHEMBL3259895
SMILES: Cc1nc2ccc(Br)cc2c(-c2ccc(Cl)cc2)c1[C@H](OC(C)(C)C)C(O)=O
InChI Key: InChIKey=UXIVWMINNPGARX-FQEVSTJZSA-N
Data: 1 IC50  1 Kd
PDB links: 2 PDB IDs match this monomer.
Activity Spreadsheet -- Enzyme Inhibition Constant Data from BindingDB
Found 2 hits for monomerid = 50011006
Trg + Lig
Ki
nM
ΔG°
kcal/mole
IC50
nM
Kd
nM
EC50/IC50
nM
koff
s-1
kon
M-1s-1
pHTemp
°C
Integrase
(Human immunodeficiency virus 1)
BDBM50011006
(CHEMBL3259895)
Show SMILES Cc1nc2ccc(Br)cc2c(-c2ccc(Cl)cc2)c1[C@H](OC(C)(C)C)C(O)=O |r|
Show InChI InChI=1S/C22H21BrClNO3/c1-12-18(20(21(26)27)28-22(2,3)4)19(13-5-8-15(24)9-6-13)16-11-14(23)7-10-17(16)25-12/h5-11,20H,1-4H3,(H,26,27)/t20-/m0/s1
n/an/a 60n/an/an/an/an/an/a
Universit£ degli Studi di Siena
Curated by ChEMBL
Assay Description
Binding affinity to recombinant HIV-1 integrase catalytic core domain expressed in Escherichia coli assessed as inhibition of interaction with LEDFG/...
Bioorg Med Chem Lett 25: 3013-6 (2015)
Article DOI: 10.1016/j.bmcl.2015.05.011
BindingDB Entry DOI: 10.7270/Q2NG4TN9
3D
3D Structure (crystal)
Human immunodeficiency virus type 1 integrase
(Human immunodeficiency virus 1)
BDBM50011006
(CHEMBL3259895)
Show SMILES Cc1nc2ccc(Br)cc2c(-c2ccc(Cl)cc2)c1[C@H](OC(C)(C)C)C(O)=O |r|
Show InChI InChI=1S/C22H21BrClNO3/c1-12-18(20(21(26)27)28-22(2,3)4)19(13-5-8-15(24)9-6-13)16-11-14(23)7-10-17(16)25-12/h5-11,20H,1-4H3,(H,26,27)/t20-/m0/s1
n/an/an/a 150n/an/an/an/an/a
Boehringer Ingelheim (Canada) Ltd.
Curated by ChEMBL
Assay Description
Binding affinity to HIV1 integrase by displacement assay
ACS Med Chem Lett 5: 422-7 (2014)
Article DOI: 10.1021/ml500002n
BindingDB Entry DOI: 10.7270/Q2K64KMK
3D
3D Structure (crystal)