BDBM50011131 CHEMBL3259890
SMILES: CCCC(C(O)=O)c1c(C)nc2ccc(Br)cc2c1-c1ccc(Cl)cc1
InChI Key: InChIKey=PGPXDDXGHYDSGQ-UHFFFAOYSA-N
Data: 1 IC50
Activity Spreadsheet -- Enzyme Inhibition Constant Data from BindingDB
Found 1 hit for monomerid = 50011131
Trg + Lig
Ki
nM
ΔG°
kcal/mole
IC50
nM
Kd
nM
EC50/IC50
nM
koff
s-1
kon
M-1s-1
pHTemp
°C
Human immunodeficiency virus type 1 integrase
(Human immunodeficiency virus 1)
BDBM50011131
(CHEMBL3259890)
Show SMILES CCCC(C(O)=O)c1c(C)nc2ccc(Br)cc2c1-c1ccc(Cl)cc1
Show InChI InChI=1S/C21H19BrClNO2/c1-3-4-16(21(25)26)19-12(2)24-18-10-7-14(22)11-17(18)20(19)13-5-8-15(23)9-6-13/h5-11,16H,3-4H2,1-2H3,(H,25,26)
n/an/a 77n/an/an/an/an/an/a
Boehringer Ingelheim (Canada) Ltd.
Curated by ChEMBL
Assay Description
Inhibition of HIV1 integrase by LTR cleavage assay
ACS Med Chem Lett 5: 422-7 (2014)
Article DOI: 10.1021/ml500002n
BindingDB Entry DOI: 10.7270/Q2K64KMK