null
SMILES: CCOc1cc(F)c(Cn2nc(c3CCCc23)-c2ncc(OC)c(Nc3ccncc3)n2)c(F)c1
InChI Key: InChIKey=UJORPFQWUKFXIE-UHFFFAOYSA-N
Activity Spreadsheet -- Enzyme Inhibition Constant Data from BindingDB
Found 1 hit for monomerid = 50011209
Trg + Lig
Ki
nM
ΔG°
kcal/mole
IC50
nM
Kd
nM
EC50/IC50
nM
koff
s-1
kon
M-1s-1
pHTemp
°C
Mitotic checkpoint serine/threonine-protein kinase BUB1
(Homo sapiens (Human))
BDBM50011209
(CHEMBL3260324)
Show SMILES CCOc1cc(F)c(Cn2nc(c3CCCc23)-c2ncc(OC)c(Nc3ccncc3)n2)c(F)c1
Show InChI InChI=1S/C25H24F2N6O2/c1-3-35-16-11-19(26)18(20(27)12-16)14-33-21-6-4-5-17(21)23(32-33)25-29-13-22(34-2)24(31-25)30-15-7-9-28-10-8-15/h7-13H,3-6,14H2,1-2H3,(H,28,29,30,31)
Reactome pathway
n/an/a 5n/an/an/an/an/an/a
Dart Neuroscience LLC
Curated by ChEMBL
Assay Description
Inhibition of Bub1 kinase (unknown origin) by TR-FRET kinase assay
ACS Med Chem Lett 5: 280-1 (2014)
Article DOI: 10.1021/ml5000492
BindingDB Entry DOI: 10.7270/Q2XG9SN8