BDBM50011545 CHEMBL430906::Desamino-Tyr(SO3H)-Met-Gly-Trp-Met-Asp-Phe-NH2
SMILES: CSCC[C@H](NC(=O)CCc1ccc(OS(O)(=O)=O)cc1)C(=O)NCC(=O)N[C@@H](Cc1c[nH]c2ccccc12)C(=O)N[C@@H](CCSC)C(=O)N[C@@H](CC(O)=O)C(=O)N[C@@H](Cc1ccccc1)C(N)=O
InChI Key: InChIKey=MJCQVODOVWSYPR-LTLCPEALSA-N
Data: 2 IC50
Activity Spreadsheet -- Enzyme Inhibition Constant Data from BindingDB
Found 2 hits for monomerid = 50011545
Trg + Lig
Ki
nM
ΔG°
kcal/mole
IC50
nM
Kd
nM
EC50/IC50
nM
koff
s-1
kon
M-1s-1
pHTemp
°C
Cholecystokinin B receptor
(Bos taurus)
BDBM50011545
(CHEMBL430906 | Desamino-Tyr(SO3H)-Met-Gly-Trp-Met-...)
Show SMILES CSCC[C@H](NC(=O)CCc1ccc(OS(O)(=O)=O)cc1)C(=O)NCC(=O)N[C@@H](Cc1c[nH]c2ccccc12)C(=O)N[C@@H](CCSC)C(=O)N[C@@H](CC(O)=O)C(=O)N[C@@H](Cc1ccccc1)C(N)=O
Show InChI InChI=1S/C45H56N8O13S3/c1-67-20-18-33(49-38(54)17-14-27-12-15-30(16-13-27)66-69(63,64)65)42(59)48-26-39(55)50-36(23-29-25-47-32-11-7-6-10-31(29)32)44(61)51-34(19-21-68-2)43(60)53-37(24-40(56)57)45(62)52-35(41(46)58)22-28-8-4-3-5-9-28/h3-13,15-16,25,33-37,47H,14,17-24,26H2,1-2H3,(H2,46,58)(H,48,59)(H,49,54)(H,50,55)(H,51,61)(H,52,62)(H,53,60)(H,56,57)(H,63,64,65)/t33-,34-,35-,36-,37-/m0/s1
Reactome pathway
n/an/a 3.10n/an/an/an/an/an/a
Roche Research Center
Curated by ChEMBL
Assay Description
Inhibition of [3H]-propanoyl binding to cholecystokinin type B receptor subtype was determined in bovine striatum membranes
J Med Chem 34: 1125-36 (1991)
BindingDB Entry DOI: 10.7270/Q27P8XCT
Cholecystokinin receptor
(RAT)
BDBM50011545
(CHEMBL430906 | Desamino-Tyr(SO3H)-Met-Gly-Trp-Met-...)
Show SMILES CSCC[C@H](NC(=O)CCc1ccc(OS(O)(=O)=O)cc1)C(=O)NCC(=O)N[C@@H](Cc1c[nH]c2ccccc12)C(=O)N[C@@H](CCSC)C(=O)N[C@@H](CC(O)=O)C(=O)N[C@@H](Cc1ccccc1)C(N)=O
Show InChI InChI=1S/C45H56N8O13S3/c1-67-20-18-33(49-38(54)17-14-27-12-15-30(16-13-27)66-69(63,64)65)42(59)48-26-39(55)50-36(23-29-25-47-32-11-7-6-10-31(29)32)44(61)51-34(19-21-68-2)43(60)53-37(24-40(56)57)45(62)52-35(41(46)58)22-28-8-4-3-5-9-28/h3-13,15-16,25,33-37,47H,14,17-24,26H2,1-2H3,(H2,46,58)(H,48,59)(H,49,54)(H,50,55)(H,51,61)(H,52,62)(H,53,60)(H,56,57)(H,63,64,65)/t33-,34-,35-,36-,37-/m0/s1
Reactome pathway
n/an/a 0.25n/an/an/an/an/an/a
Roche Research Center
Curated by ChEMBL
Assay Description
Inhibition of [3H]-propanoyl binding to cholecystokinin type A receptor was determined in fresh rat pancreatic tissue membranes
J Med Chem 34: 1125-36 (1991)
BindingDB Entry DOI: 10.7270/Q27P8XCT