BDBM50011556 CHEMBL3262575::US9592235, Example 164::US9855269, Compound 7
SMILES: Nc1ncnc2ccc(cc12)-c1cccc(c1)C#N
InChI Key: InChIKey=ZCFWCGFNEWHTRE-UHFFFAOYSA-N
Data: 4 IC50
Activity Spreadsheet -- Enzyme Inhibition Constant Data from BindingDB
Found 4 hits for monomerid = 50011556
Trg + Lig
Ki
nM
ΔG°
kcal/mole
IC50
nM
Kd
nM
EC50/IC50
nM
koff
s-1
kon
M-1s-1
pHTemp
°C
Mitogen-activated protein kinase kinase kinase kinase 4
(Homo sapiens (Human))
BDBM50011556
(CHEMBL3262575 | US9592235, Example 164 | US9855269...)
Show SMILES Nc1ncnc2ccc(cc12)-c1cccc(c1)C#N
Show InChI InChI=1S/C15H10N4/c16-8-10-2-1-3-11(6-10)12-4-5-14-13(7-12)15(17)19-9-18-14/h1-7,9H,(H2,17,18,19)
NCI pathway
Reactome pathway
n/an/a 225n/an/an/an/an/an/a
Genentech Inc.
Curated by ChEMBL
Assay Description
Inhibition of human MAP4K4 using 5-FAM-LGRDKYKTLRQIRQ-COOH as substrate by Z'-LYTE assay
J Med Chem 57: 3484-93 (2014)
Article DOI: 10.1021/jm500155b
BindingDB Entry DOI: 10.7270/Q2M046ZR
Mitogen-activated protein kinase kinase kinase kinase 4
(Homo sapiens (Human))
BDBM50011556
(CHEMBL3262575 | US9592235, Example 164 | US9855269...)
Show SMILES Nc1ncnc2ccc(cc12)-c1cccc(c1)C#N
Show InChI InChI=1S/C15H10N4/c16-8-10-2-1-3-11(6-10)12-4-5-14-13(7-12)15(17)19-9-18-14/h1-7,9H,(H2,17,18,19)
NCI pathway
Reactome pathway
US Patent
n/an/a 258n/an/an/an/an/an/a
Merck Frosst Centre for Therapeutic Research
Assay Description
The kinase activity of purified human MAP4K4 kinase domain was measured by monitoring the phosphorylation of a peptide substrate derived from moesin ...
J Med Chem 46: 3709-27 (2003)
BindingDB Entry DOI: 10.7270/Q2VH5R4B
Mitogen-activated protein kinase kinase kinase kinase 4
(Homo sapiens (Human))
BDBM50011556
(CHEMBL3262575 | US9592235, Example 164 | US9855269...)
Show SMILES Nc1ncnc2ccc(cc12)-c1cccc(c1)C#N
Show InChI InChI=1S/C15H10N4/c16-8-10-2-1-3-11(6-10)12-4-5-14-13(7-12)15(17)19-9-18-14/h1-7,9H,(H2,17,18,19)
NCI pathway
Reactome pathway
US Patent
n/an/a 258n/an/an/an/an/an/a
Genentech, Inc.
US Patent
Assay Description
The kinase activity of purified human MAP4K4 kinase domain was measured by monitoring the phosphorylation of a peptide substrate derived from moesin ...
US Patent US9592235 (2017)
BindingDB Entry DOI: 10.7270/Q2VX0JKX
Mitogen-activated protein kinase kinase kinase kinase 4
(Homo sapiens (Human))
BDBM50011556
(CHEMBL3262575 | US9592235, Example 164 | US9855269...)
Show SMILES Nc1ncnc2ccc(cc12)-c1cccc(c1)C#N
Show InChI InChI=1S/C15H10N4/c16-8-10-2-1-3-11(6-10)12-4-5-14-13(7-12)15(17)19-9-18-14/h1-7,9H,(H2,17,18,19)
NCI pathway
Reactome pathway
US Patent
n/an/a 6.20E+3n/an/an/an/an/an/a
Genentech, Inc.
US Patent
Assay Description
The kinase activity of purified human MAP4K4 kinase domain was measured by monitoring the phosphorylation of a peptide substrate derived from moesin ...
US Patent US9592235 (2017)
BindingDB Entry DOI: 10.7270/Q2VX0JKX