null
SMILES: COc1ccc(\C=C\C(=O)N2CCN(CC2)C(=O)c2ccc3OCCc3c2)cc1
InChI Key: InChIKey=KORXTZSQLAAUIS-RUDMXATFSA-N
Activity Spreadsheet -- Enzyme Inhibition Constant Data from BindingDB
Found 2 hits for monomerid = 50011592
Trg + Lig
Ki
nM
ΔG°
kcal/mole
IC50
nM
Kd
nM
EC50/IC50
nM
koff
s-1
kon
M-1s-1
pHTemp
°C
G-protein coupled receptor 183
(Mus musculus)
BDBM50011592
(CHEMBL3262891)
Show SMILES COc1ccc(\C=C\C(=O)N2CCN(CC2)C(=O)c2ccc3OCCc3c2)cc1
Show InChI InChI=1S/C23H24N2O4/c1-28-20-6-2-17(3-7-20)4-9-22(26)24-11-13-25(14-12-24)23(27)19-5-8-21-18(16-19)10-15-29-21/h2-9,16H,10-15H2,1H3/b9-4+
n/an/a 29n/an/an/an/an/an/a
Novartis Institutes for BioMedical Research
Curated by ChEMBL
Assay Description
Antagonist activity at recombinant mouse EBI2 receptor expressed in CHO cells assessed as inhibition of NIBR51-induced intracellular calcium release ...
J Med Chem 57: 3358-68 (2014)
Article DOI: 10.1021/jm4019355
BindingDB Entry DOI: 10.7270/Q2BG2QJ5
G-protein coupled receptor 183
(Homo sapiens (Human))
BDBM50011592
(CHEMBL3262891)
Show SMILES COc1ccc(\C=C\C(=O)N2CCN(CC2)C(=O)c2ccc3OCCc3c2)cc1
Show InChI InChI=1S/C23H24N2O4/c1-28-20-6-2-17(3-7-20)4-9-22(26)24-11-13-25(14-12-24)23(27)19-5-8-21-18(16-19)10-15-29-21/h2-9,16H,10-15H2,1H3/b9-4+
n/an/a 18n/an/an/an/an/an/a
Novartis Institutes for BioMedical Research
Curated by ChEMBL
Assay Description
Antagonist activity at recombinant human EBI2 receptor expressed in CHO cells assessed as inhibition of NIBR51-induced intracellular calcium release ...
J Med Chem 57: 3358-68 (2014)
Article DOI: 10.1021/jm4019355
BindingDB Entry DOI: 10.7270/Q2BG2QJ5