null
SMILES: Cc1nnc2CN=C(c3cc(sc3-n12)C#CCn1c2ccccc2c2ccccc2c1=O)c1ccccc1Cl
InChI Key: InChIKey=MPMZSZMDCRPSRF-UHFFFAOYSA-N
Activity Spreadsheet -- Enzyme Inhibition Constant Data from BindingDB
Found 1 hit for monomerid = 50011638
Trg + Lig
Ki
nM
ΔG°
kcal/mole
IC50
nM
Kd
nM
EC50/IC50
nM
koff
s-1
kon
M-1s-1
pHTemp
°C
Platelet-activating factor receptor
(Homo sapiens (Human))
BDBM50011638
(5-{3-[4-(2-Chloro-phenyl)-9-methyl-6H-1-thia-5,7,8...)
Show SMILES Cc1nnc2CN=C(c3cc(sc3-n12)C#CCn1c2ccccc2c2ccccc2c1=O)c1ccccc1Cl |c:6|
Show InChI InChI=1S/C31H20ClN5OS/c1-19-34-35-28-18-33-29(24-13-4-6-14-26(24)32)25-17-20(39-31(25)37(19)28)9-8-16-36-27-15-7-5-11-22(27)21-10-2-3-12-23(21)30(36)38/h2-7,10-15,17H,16,18H2,1H3
Reactome pathway
n/an/a 13n/an/an/an/an/an/a
Roche Research Center
Curated by ChEMBL
Assay Description
PAF-antagonist activity determined in dog platelets by PAF-binding assay
J Med Chem 34: 1209-21 (1991)
BindingDB Entry DOI: 10.7270/Q23X85M1