null
SMILES: Cc1nnc2CN=C(c3cc(sc3-n12)C#CCn1c2ccccc2ccc1=O)c1ccccc1Cl
InChI Key: InChIKey=PKJFVZVXBKKWNC-UHFFFAOYSA-N
Activity Spreadsheet -- Enzyme Inhibition Constant Data from BindingDB
Found 1 hit for monomerid = 50011669
Trg + Lig
Ki
nM
ΔG°
kcal/mole
IC50
nM
Kd
nM
EC50/IC50
nM
koff
s-1
kon
M-1s-1
pHTemp
°C
Platelet-activating factor receptor
(Homo sapiens (Human))
BDBM50011669
(1-{3-[4-(2-Chloro-phenyl)-9-methyl-6H-1-thia-5,7,8...)
Show SMILES Cc1nnc2CN=C(c3cc(sc3-n12)C#CCn1c2ccccc2ccc1=O)c1ccccc1Cl |c:6|
Show InChI InChI=1S/C27H18ClN5OS/c1-17-30-31-24-16-29-26(20-9-3-4-10-22(20)28)21-15-19(35-27(21)33(17)24)8-6-14-32-23-11-5-2-7-18(23)12-13-25(32)34/h2-5,7,9-13,15H,14,16H2,1H3
Reactome pathway
n/an/a 2n/an/an/an/an/an/a
Roche Research Center
Curated by ChEMBL
Assay Description
PAF-antagonist activity determined in dog platelets by PAF-binding assay
J Med Chem 34: 1209-21 (1991)
BindingDB Entry DOI: 10.7270/Q23X85M1