BDBM50011694 CHEMBL354360::{1-[1-[2-(5-Benzyloxymethyl-1-methyl-2-oxo-pyrrolidin-3-yl)-1-cyclohexylmethyl-2-hydroxy-ethylcarbamoyl]-2-(1H-imidazol-4-yl)-ethylcarbamoyl]-2-phenyl-ethyl}-carbamic acid tert-butyl ester
SMILES: CN1[C@H](COCc2ccccc2)C[C@@H]([C@H](O)[C@H](CC2CCCCC2)NC(=O)[C@H](Cc2cnc[nH]2)NC(=O)[C@H](Cc2ccccc2)NC(=O)OC(C)(C)C)C1=O
InChI Key: InChIKey=UVZNGTDEZCYVKR-DUGSHLAESA-N
Data: 4 IC50
Activity Spreadsheet -- Enzyme Inhibition Constant Data from BindingDB
Found 4 hits for monomerid = 50011694
Trg + Lig
Ki
nM
ΔG°
kcal/mole
IC50
nM
Kd
nM
EC50/IC50
nM
koff
s-1
kon
M-1s-1
pHTemp
°C
Pepsin A
(Porcine)
BDBM50011694
(CHEMBL354360 | {1-[1-[2-(5-Benzyloxymethyl-1-methy...)
Show SMILES CN1[C@H](COCc2ccccc2)C[C@@H]([C@H](O)[C@H](CC2CCCCC2)NC(=O)[C@H](Cc2cnc[nH]2)NC(=O)[C@H](Cc2ccccc2)NC(=O)OC(C)(C)C)C1=O
Show InChI InChI=1S/C42H58N6O7/c1-42(2,3)55-41(53)47-35(21-29-16-10-6-11-17-29)38(50)46-36(22-31-24-43-27-44-31)39(51)45-34(20-28-14-8-5-9-15-28)37(49)33-23-32(48(4)40(33)52)26-54-25-30-18-12-7-13-19-30/h6-7,10-13,16-19,24,27-28,32-37,49H,5,8-9,14-15,20-23,25-26H2,1-4H3,(H,43,44)(H,45,51)(H,46,50)(H,47,53)/t32-,33-,34-,35-,36-,37-/m0/s1
n/an/a 1.00E+3n/an/an/an/an/an/a
Merck Sharp and Dohme Research Laboratories
Curated by ChEMBL
Assay Description
Inhibitory concentration against Pepsin
J Med Chem 34: 887-900 (1991)
BindingDB Entry DOI: 10.7270/Q2MK6DGK
Renin
(Homo sapiens (Human))
BDBM50011694
(CHEMBL354360 | {1-[1-[2-(5-Benzyloxymethyl-1-methy...)
Show SMILES CN1[C@H](COCc2ccccc2)C[C@@H]([C@H](O)[C@H](CC2CCCCC2)NC(=O)[C@H](Cc2cnc[nH]2)NC(=O)[C@H](Cc2ccccc2)NC(=O)OC(C)(C)C)C1=O
Show InChI InChI=1S/C42H58N6O7/c1-42(2,3)55-41(53)47-35(21-29-16-10-6-11-17-29)38(50)46-36(22-31-24-43-27-44-31)39(51)45-34(20-28-14-8-5-9-15-28)37(49)33-23-32(48(4)40(33)52)26-54-25-30-18-12-7-13-19-30/h6-7,10-13,16-19,24,27-28,32-37,49H,5,8-9,14-15,20-23,25-26H2,1-4H3,(H,43,44)(H,45,51)(H,46,50)(H,47,53)/t32-,33-,34-,35-,36-,37-/m0/s1
Reactome pathway
n/an/a 4.40E+3n/an/an/an/a7.4n/a
Merck Sharp and Dohme Research Laboratories
Curated by ChEMBL
Assay Description
In vitro renin inhibition was measured at pH 7.4 by using human plasma renin assay
J Med Chem 34: 887-900 (1991)
BindingDB Entry DOI: 10.7270/Q2MK6DGK
Pepsinogen C
(Homo sapiens (Human))
BDBM50011694
(CHEMBL354360 | {1-[1-[2-(5-Benzyloxymethyl-1-methy...)
Show SMILES CN1[C@H](COCc2ccccc2)C[C@@H]([C@H](O)[C@H](CC2CCCCC2)NC(=O)[C@H](Cc2cnc[nH]2)NC(=O)[C@H](Cc2ccccc2)NC(=O)OC(C)(C)C)C1=O
Show InChI InChI=1S/C42H58N6O7/c1-42(2,3)55-41(53)47-35(21-29-16-10-6-11-17-29)38(50)46-36(22-31-24-43-27-44-31)39(51)45-34(20-28-14-8-5-9-15-28)37(49)33-23-32(48(4)40(33)52)26-54-25-30-18-12-7-13-19-30/h6-7,10-13,16-19,24,27-28,32-37,49H,5,8-9,14-15,20-23,25-26H2,1-4H3,(H,43,44)(H,45,51)(H,46,50)(H,47,53)/t32-,33-,34-,35-,36-,37-/m0/s1
n/an/a 1.00E+3n/an/an/an/an/an/a
Merck Sharp and Dohme Research Laboratories
Curated by ChEMBL
Assay Description
Inhibitory concentration against Gastricsin
J Med Chem 34: 887-900 (1991)
BindingDB Entry DOI: 10.7270/Q2MK6DGK
Cathepsin D
(Homo sapiens (Human))
BDBM50011694
(CHEMBL354360 | {1-[1-[2-(5-Benzyloxymethyl-1-methy...)
Show SMILES CN1[C@H](COCc2ccccc2)C[C@@H]([C@H](O)[C@H](CC2CCCCC2)NC(=O)[C@H](Cc2cnc[nH]2)NC(=O)[C@H](Cc2ccccc2)NC(=O)OC(C)(C)C)C1=O
Show InChI InChI=1S/C42H58N6O7/c1-42(2,3)55-41(53)47-35(21-29-16-10-6-11-17-29)38(50)46-36(22-31-24-43-27-44-31)39(51)45-34(20-28-14-8-5-9-15-28)37(49)33-23-32(48(4)40(33)52)26-54-25-30-18-12-7-13-19-30/h6-7,10-13,16-19,24,27-28,32-37,49H,5,8-9,14-15,20-23,25-26H2,1-4H3,(H,43,44)(H,45,51)(H,46,50)(H,47,53)/t32-,33-,34-,35-,36-,37-/m0/s1
NCI pathway
Reactome pathway
n/an/a 115n/an/an/an/an/an/a
Merck Sharp and Dohme Research Laboratories
Curated by ChEMBL
Assay Description
Inhibitory concentration against cathepsin D
J Med Chem 34: 887-900 (1991)
BindingDB Entry DOI: 10.7270/Q2MK6DGK