BDBM50011721 CHEMBL3262879
SMILES: Brc1ccc(\C=C\C(=O)N2CCN(CC2)C(=O)Cc2ccccc2)cc1
InChI Key: InChIKey=WEMKDXBKPLKJDT-DHZHZOJOSA-N
Data: 2 IC50
Activity Spreadsheet -- Enzyme Inhibition Constant Data from BindingDB
Found 2 hits for monomerid = 50011721
Trg + Lig
Ki
nM
ΔG°
kcal/mole
IC50
nM
Kd
nM
EC50/IC50
nM
koff
s-1
kon
M-1s-1
pHTemp
°C
G-protein coupled receptor 183
(Mus musculus)
BDBM50011721
(CHEMBL3262879)
Show SMILES Brc1ccc(\C=C\C(=O)N2CCN(CC2)C(=O)Cc2ccccc2)cc1
Show InChI InChI=1S/C21H21BrN2O2/c22-19-9-6-17(7-10-19)8-11-20(25)23-12-14-24(15-13-23)21(26)16-18-4-2-1-3-5-18/h1-11H,12-16H2/b11-8+
n/an/a 29n/an/an/an/an/an/a
Novartis Institutes for BioMedical Research
Curated by ChEMBL
Assay Description
Antagonist activity at recombinant mouse EBI2 receptor expressed in CHO cells assessed as inhibition of NIBR51-induced intracellular calcium release ...
J Med Chem 57: 3358-68 (2014)
Article DOI: 10.1021/jm4019355
BindingDB Entry DOI: 10.7270/Q2BG2QJ5
G-protein coupled receptor 183
(Homo sapiens (Human))
BDBM50011721
(CHEMBL3262879)
Show SMILES Brc1ccc(\C=C\C(=O)N2CCN(CC2)C(=O)Cc2ccccc2)cc1
Show InChI InChI=1S/C21H21BrN2O2/c22-19-9-6-17(7-10-19)8-11-20(25)23-12-14-24(15-13-23)21(26)16-18-4-2-1-3-5-18/h1-11H,12-16H2/b11-8+
n/an/a 21n/an/an/an/an/an/a
Novartis Institutes for BioMedical Research
Curated by ChEMBL
Assay Description
Antagonist activity at recombinant human EBI2 receptor expressed in CHO cells assessed as inhibition of NIBR51-induced intracellular calcium release ...
J Med Chem 57: 3358-68 (2014)
Article DOI: 10.1021/jm4019355
BindingDB Entry DOI: 10.7270/Q2BG2QJ5