null
SMILES: COc1ccc(\C=C\C(=O)N2CCN(CC2)C(=O)c2ccc(Br)cc2)cc1
InChI Key: InChIKey=SFGNFJHYZWZCMR-NYYWCZLTSA-N
Activity Spreadsheet -- Enzyme Inhibition Constant Data from BindingDB
Found 2 hits for monomerid = 50011728
Trg + Lig
Ki
nM
ΔG°
kcal/mole
IC50
nM
Kd
nM
EC50/IC50
nM
koff
s-1
kon
M-1s-1
pHTemp
°C
G-protein coupled receptor 183
(Mus musculus)
BDBM50011728
(CHEMBL3262886)
Show SMILES COc1ccc(\C=C\C(=O)N2CCN(CC2)C(=O)c2ccc(Br)cc2)cc1
Show InChI InChI=1S/C21H21BrN2O3/c1-27-19-9-2-16(3-10-19)4-11-20(25)23-12-14-24(15-13-23)21(26)17-5-7-18(22)8-6-17/h2-11H,12-15H2,1H3/b11-4+
n/an/a 79n/an/an/an/an/an/a
Novartis Institutes for BioMedical Research
Curated by ChEMBL
Assay Description
Antagonist activity at recombinant mouse EBI2 receptor expressed in CHO cells assessed as inhibition of NIBR51-induced intracellular calcium release ...
J Med Chem 57: 3358-68 (2014)
Article DOI: 10.1021/jm4019355
BindingDB Entry DOI: 10.7270/Q2BG2QJ5
G-protein coupled receptor 183
(Homo sapiens (Human))
BDBM50011728
(CHEMBL3262886)
Show SMILES COc1ccc(\C=C\C(=O)N2CCN(CC2)C(=O)c2ccc(Br)cc2)cc1
Show InChI InChI=1S/C21H21BrN2O3/c1-27-19-9-2-16(3-10-19)4-11-20(25)23-12-14-24(15-13-23)21(26)17-5-7-18(22)8-6-17/h2-11H,12-15H2,1H3/b11-4+
n/an/a 68n/an/an/an/an/an/a
Novartis Institutes for BioMedical Research
Curated by ChEMBL
Assay Description
Antagonist activity at recombinant human EBI2 receptor expressed in CHO cells assessed as inhibition of NIBR51-induced intracellular calcium release ...
J Med Chem 57: 3358-68 (2014)
Article DOI: 10.1021/jm4019355
BindingDB Entry DOI: 10.7270/Q2BG2QJ5