BDBM50011730 CHEMBL3262888
SMILES: COc1ccc(\C=C\C(=O)N2CCN(CC2)C(=O)c2ccc(OC)cc2)cc1
InChI Key: InChIKey=VDNZNRMNHMVISM-LFYBBSHMSA-N
Data: 2 IC50
Activity Spreadsheet -- Enzyme Inhibition Constant Data from BindingDB
Found 2 hits for monomerid = 50011730
Trg + Lig
Ki
nM
ΔG°
kcal/mole
IC50
nM
Kd
nM
EC50/IC50
nM
koff
s-1
kon
M-1s-1
pHTemp
°C
G-protein coupled receptor 183
(Mus musculus)
BDBM50011730
(CHEMBL3262888)
Show SMILES COc1ccc(\C=C\C(=O)N2CCN(CC2)C(=O)c2ccc(OC)cc2)cc1
Show InChI InChI=1S/C22H24N2O4/c1-27-19-8-3-17(4-9-19)5-12-21(25)23-13-15-24(16-14-23)22(26)18-6-10-20(28-2)11-7-18/h3-12H,13-16H2,1-2H3/b12-5+
n/an/a 55n/an/an/an/an/an/a
Novartis Institutes for BioMedical Research
Curated by ChEMBL
Assay Description
Antagonist activity at recombinant mouse EBI2 receptor expressed in CHO cells assessed as inhibition of NIBR51-induced intracellular calcium release ...
J Med Chem 57: 3358-68 (2014)
Article DOI: 10.1021/jm4019355
BindingDB Entry DOI: 10.7270/Q2BG2QJ5
G-protein coupled receptor 183
(Homo sapiens (Human))
BDBM50011730
(CHEMBL3262888)
Show SMILES COc1ccc(\C=C\C(=O)N2CCN(CC2)C(=O)c2ccc(OC)cc2)cc1
Show InChI InChI=1S/C22H24N2O4/c1-27-19-8-3-17(4-9-19)5-12-21(25)23-13-15-24(16-14-23)22(26)18-6-10-20(28-2)11-7-18/h3-12H,13-16H2,1-2H3/b12-5+
n/an/a 32n/an/an/an/an/an/a
Novartis Institutes for BioMedical Research
Curated by ChEMBL
Assay Description
Antagonist activity at recombinant human EBI2 receptor expressed in CHO cells assessed as inhibition of NIBR51-induced intracellular calcium release ...
J Med Chem 57: 3358-68 (2014)
Article DOI: 10.1021/jm4019355
BindingDB Entry DOI: 10.7270/Q2BG2QJ5