null
SMILES: Cc1nnc2CN=C(c3cc(sc3-n12)C#C)c1ccccc1Cl
InChI Key: InChIKey=GNNCDOBXOJMAGO-UHFFFAOYSA-N
Activity Spreadsheet -- Enzyme Inhibition Constant Data from BindingDB
Found 1 hit for monomerid = 50011876
Trg + Lig
Ki
nM
ΔG°
kcal/mole
IC50
nM
Kd
nM
EC50/IC50
nM
koff
s-1
kon
M-1s-1
pHTemp
°C
Platelet-activating factor receptor
(Homo sapiens (Human))
BDBM50011876
(4-(2-Chloro-phenyl)-2-ethynyl-9-methyl-6H-1-thia-5...)
Show SMILES Cc1nnc2CN=C(c3cc(sc3-n12)C#C)c1ccccc1Cl |c:6|
Show InChI InChI=1S/C17H11ClN4S/c1-3-11-8-13-16(12-6-4-5-7-14(12)18)19-9-15-21-20-10(2)22(15)17(13)23-11/h1,4-8H,9H2,2H3
Reactome pathway
n/an/a 10n/an/an/an/an/an/a
Roche Research Center
Curated by ChEMBL
Assay Description
In vitro for platelet activating factor receptor antagonist activity in a binding assay using washed whole dog platelets.
J Med Chem 34: 1440-6 (1991)
BindingDB Entry DOI: 10.7270/Q2BG2MZ9