BDBM50012951 4-Cyclohexyl-2-hydroxy-3-[3-(1H-imidazol-4-yl)-2-(4-morpholin-4-yl-2-naphthalen-1-ylmethyl-4-oxo-butyrylamino)-propionylamino]-butyric acid isopropyl ester::CHEMBL3350322::CHEMBL91826
SMILES: CC(C)OC(=O)[C@H](O)[C@H](CC1CCCCC1)NC(=O)[C@H](Cc1c[nH]cn1)NC(=O)[C@@H](CC(=O)N1CCOCC1)Cc1cccc2ccccc12
InChI Key: InChIKey=NQXSBCTYTMQGGJ-PSPBILMESA-N
Data: 6 IC50
Activity Spreadsheet -- Enzyme Inhibition Constant Data from BindingDB
Found 6 hits for monomerid = 50012951
Trg + Lig
Ki
nM
ΔG°
kcal/mole
IC50
nM
Kd
nM
EC50/IC50
nM
koff
s-1
kon
M-1s-1
pHTemp
°C
Renin
(Homo sapiens (Human))
BDBM50012951
(4-Cyclohexyl-2-hydroxy-3-[3-(1H-imidazol-4-yl)-2-(...)
Show SMILES CC(C)OC(=O)[C@H](O)[C@H](CC1CCCCC1)NC(=O)[C@H](Cc1c[nH]cn1)NC(=O)[C@@H](CC(=O)N1CCOCC1)Cc1cccc2ccccc12
Show InChI InChI=1S/C38H51N5O7/c1-25(2)50-38(48)35(45)32(19-26-9-4-3-5-10-26)41-37(47)33(22-30-23-39-24-40-30)42-36(46)29(21-34(44)43-15-17-49-18-16-43)20-28-13-8-12-27-11-6-7-14-31(27)28/h6-8,11-14,23-26,29,32-33,35,45H,3-5,9-10,15-22H2,1-2H3,(H,39,40)(H,41,47)(H,42,46)/t29-,32-,33-,35?/m1/s1
Reactome pathway
n/an/a 2.40n/an/an/an/an/an/a
Kissei Pharmaceutical Company, Ltd.
Curated by ChEMBL
Assay Description
Tested for inhibition of renin from human
J Med Chem 33: 2707-14 (1990)
BindingDB Entry DOI: 10.7270/Q2N29XJZ
Chymotrypsin C
(Homo sapiens (Human))
BDBM50012951
(4-Cyclohexyl-2-hydroxy-3-[3-(1H-imidazol-4-yl)-2-(...)
Show SMILES CC(C)OC(=O)[C@H](O)[C@H](CC1CCCCC1)NC(=O)[C@H](Cc1c[nH]cn1)NC(=O)[C@@H](CC(=O)N1CCOCC1)Cc1cccc2ccccc12
Show InChI InChI=1S/C38H51N5O7/c1-25(2)50-38(48)35(45)32(19-26-9-4-3-5-10-26)41-37(47)33(22-30-23-39-24-40-30)42-36(46)29(21-34(44)43-15-17-49-18-16-43)20-28-13-8-12-27-11-6-7-14-31(27)28/h6-8,11-14,23-26,29,32-33,35,45H,3-5,9-10,15-22H2,1-2H3,(H,39,40)(H,41,47)(H,42,46)/t29-,32-,33-,35?/m1/s1
n/an/a>1.00E+5n/an/an/an/an/an/a
Kissei Pharmaceutical Company, Ltd.
Curated by ChEMBL
Assay Description
Tested for inhibition of renin from human
J Med Chem 33: 2707-14 (1990)
BindingDB Entry DOI: 10.7270/Q2N29XJZ
Angiotensin-converting enzyme
(Oryctolagus cuniculus)
BDBM50012951
(4-Cyclohexyl-2-hydroxy-3-[3-(1H-imidazol-4-yl)-2-(...)
Show SMILES CC(C)OC(=O)[C@H](O)[C@H](CC1CCCCC1)NC(=O)[C@H](Cc1c[nH]cn1)NC(=O)[C@@H](CC(=O)N1CCOCC1)Cc1cccc2ccccc12
Show InChI InChI=1S/C38H51N5O7/c1-25(2)50-38(48)35(45)32(19-26-9-4-3-5-10-26)41-37(47)33(22-30-23-39-24-40-30)42-36(46)29(21-34(44)43-15-17-49-18-16-43)20-28-13-8-12-27-11-6-7-14-31(27)28/h6-8,11-14,23-26,29,32-33,35,45H,3-5,9-10,15-22H2,1-2H3,(H,39,40)(H,41,47)(H,42,46)/t29-,32-,33-,35?/m1/s1
n/an/a>1.00E+5n/an/an/an/an/an/a
Kissei Pharmaceutical Company, Ltd.
Curated by ChEMBL
Assay Description
Tested for inhibition of Angiotensin I converting enzyme from rabbit.
J Med Chem 33: 2707-14 (1990)
BindingDB Entry DOI: 10.7270/Q2N29XJZ
Renin
(Homo sapiens (Human))
BDBM50012951
(4-Cyclohexyl-2-hydroxy-3-[3-(1H-imidazol-4-yl)-2-(...)
Show SMILES CC(C)OC(=O)[C@H](O)[C@H](CC1CCCCC1)NC(=O)[C@H](Cc1c[nH]cn1)NC(=O)[C@@H](CC(=O)N1CCOCC1)Cc1cccc2ccccc12
Show InChI InChI=1S/C38H51N5O7/c1-25(2)50-38(48)35(45)32(19-26-9-4-3-5-10-26)41-37(47)33(22-30-23-39-24-40-30)42-36(46)29(21-34(44)43-15-17-49-18-16-43)20-28-13-8-12-27-11-6-7-14-31(27)28/h6-8,11-14,23-26,29,32-33,35,45H,3-5,9-10,15-22H2,1-2H3,(H,39,40)(H,41,47)(H,42,46)/t29-,32-,33-,35?/m1/s1
Reactome pathway
n/an/a 4.70n/an/an/an/an/an/a
Kissei Pharmaceutical Company, Ltd.
Curated by ChEMBL
Assay Description
Tested for inhibition of human plasma renin
J Med Chem 33: 2707-14 (1990)
BindingDB Entry DOI: 10.7270/Q2N29XJZ
Cathepsin D
(Bos taurus)
BDBM50012951
(4-Cyclohexyl-2-hydroxy-3-[3-(1H-imidazol-4-yl)-2-(...)
Show SMILES CC(C)OC(=O)[C@H](O)[C@H](CC1CCCCC1)NC(=O)[C@H](Cc1c[nH]cn1)NC(=O)[C@@H](CC(=O)N1CCOCC1)Cc1cccc2ccccc12
Show InChI InChI=1S/C38H51N5O7/c1-25(2)50-38(48)35(45)32(19-26-9-4-3-5-10-26)41-37(47)33(22-30-23-39-24-40-30)42-36(46)29(21-34(44)43-15-17-49-18-16-43)20-28-13-8-12-27-11-6-7-14-31(27)28/h6-8,11-14,23-26,29,32-33,35,45H,3-5,9-10,15-22H2,1-2H3,(H,39,40)(H,41,47)(H,42,46)/t29-,32-,33-,35?/m1/s1
n/an/a 8.00E+4n/an/an/an/an/an/a
Kissei Pharmaceutical Company, Ltd.
Curated by ChEMBL
Assay Description
Tested for inhibition of Cathepsin D from bovine
J Med Chem 33: 2707-14 (1990)
BindingDB Entry DOI: 10.7270/Q2N29XJZ
Pepsin A
(Porcine)
BDBM50012951
(4-Cyclohexyl-2-hydroxy-3-[3-(1H-imidazol-4-yl)-2-(...)
Show SMILES CC(C)OC(=O)[C@H](O)[C@H](CC1CCCCC1)NC(=O)[C@H](Cc1c[nH]cn1)NC(=O)[C@@H](CC(=O)N1CCOCC1)Cc1cccc2ccccc12
Show InChI InChI=1S/C38H51N5O7/c1-25(2)50-38(48)35(45)32(19-26-9-4-3-5-10-26)41-37(47)33(22-30-23-39-24-40-30)42-36(46)29(21-34(44)43-15-17-49-18-16-43)20-28-13-8-12-27-11-6-7-14-31(27)28/h6-8,11-14,23-26,29,32-33,35,45H,3-5,9-10,15-22H2,1-2H3,(H,39,40)(H,41,47)(H,42,46)/t29-,32-,33-,35?/m1/s1
n/an/a>1.00E+5n/an/an/an/an/an/a
Kissei Pharmaceutical Company, Ltd.
Curated by ChEMBL
Assay Description
Tested for inhibition of pepsin from porcine
J Med Chem 33: 2707-14 (1990)
BindingDB Entry DOI: 10.7270/Q2N29XJZ