BDBM50013423 CHEMBL3263761
SMILES: CNC(=O)c1ccc(nc1OC)C1=NN([C@H](C1)C1CCCC1)c1ccc(C#N)c(C)c1
InChI Key: InChIKey=GIGLOUBLJGBNFW-JOCHJYFZSA-N
Data: 3 IC50
Activity Spreadsheet -- Enzyme Inhibition Constant Data from BindingDB
Found 3 hits for monomerid = 50013423
Trg + Lig
Ki
nM
ΔG°
kcal/mole
IC50
nM
Kd
nM
EC50/IC50
nM
koff
s-1
kon
M-1s-1
pHTemp
°C
Mineralocorticoid receptor
(Homo sapiens (Human))
BDBM50013423
(CHEMBL3263761)
Show SMILES CNC(=O)c1ccc(nc1OC)C1=NN([C@H](C1)C1CCCC1)c1ccc(C#N)c(C)c1 |r,t:13|
Show InChI InChI=1S/C24H27N5O2/c1-15-12-18(9-8-17(15)14-25)29-22(16-6-4-5-7-16)13-21(28-29)20-11-10-19(23(30)26-2)24(27-20)31-3/h8-12,16,22H,4-7,13H2,1-3H3,(H,26,30)/t22-/m1/s1
n/an/a 18n/an/an/an/an/an/a
Pfizer Inc.
Curated by ChEMBL
Assay Description
Antagonist activity at mineralocorticoid receptor (unknown origin) by Gal4-based cellular assay
J Med Chem 57: 4273-88 (2014)
Article DOI: 10.1021/jm500206r
BindingDB Entry DOI: 10.7270/Q2D50PGM
Androgen receptor
(Homo sapiens (Human))
BDBM50013423
(CHEMBL3263761)
Show SMILES CNC(=O)c1ccc(nc1OC)C1=NN([C@H](C1)C1CCCC1)c1ccc(C#N)c(C)c1 |r,t:13|
Show InChI InChI=1S/C24H27N5O2/c1-15-12-18(9-8-17(15)14-25)29-22(16-6-4-5-7-16)13-21(28-29)20-11-10-19(23(30)26-2)24(27-20)31-3/h8-12,16,22H,4-7,13H2,1-3H3,(H,26,30)/t22-/m1/s1
NCI pathway
Reactome pathway
n/an/a>1.00E+4n/an/an/an/an/an/a
Pfizer Inc.
Curated by ChEMBL
Assay Description
Antagonist activity at androgen receptor (unknown origin) by Gal4-based cellular assay
J Med Chem 57: 4273-88 (2014)
Article DOI: 10.1021/jm500206r
BindingDB Entry DOI: 10.7270/Q2D50PGM
Progesterone receptor
(Homo sapiens (Human))
BDBM50013423
(CHEMBL3263761)
Show SMILES CNC(=O)c1ccc(nc1OC)C1=NN([C@H](C1)C1CCCC1)c1ccc(C#N)c(C)c1 |r,t:13|
Show InChI InChI=1S/C24H27N5O2/c1-15-12-18(9-8-17(15)14-25)29-22(16-6-4-5-7-16)13-21(28-29)20-11-10-19(23(30)26-2)24(27-20)31-3/h8-12,16,22H,4-7,13H2,1-3H3,(H,26,30)/t22-/m1/s1
n/an/a 3.67E+3n/an/an/an/an/an/a
Pfizer Inc.
Curated by ChEMBL
Assay Description
Antagonist activity at progesterone receptor (unknown origin) by Gal4-based cellular assay
J Med Chem 57: 4273-88 (2014)
Article DOI: 10.1021/jm500206r
BindingDB Entry DOI: 10.7270/Q2D50PGM