BDBM50013437 CHEMBL3264107
SMILES: CCOP(=O)(CC)Cc1cccc(Nc2cc(ncn2)-c2ccccc2OC)c1
InChI Key: InChIKey=GYMVAYZPQOPYJH-UHFFFAOYSA-N
Data: 1 IC50
Activity Spreadsheet -- Enzyme Inhibition Constant Data from BindingDB
Found 1 hit for monomerid = 50013437
Trg + Lig
Ki
nM
ΔG°
kcal/mole
IC50
nM
Kd
nM
EC50/IC50
nM
koff
s-1
kon
M-1s-1
pHTemp
°C
Cyclin-Dependent Kinase 9 (CDK9)
(Homo sapiens (Human))
BDBM50013437
(CHEMBL3264107)
Show SMILES CCOP(=O)(CC)Cc1cccc(Nc2cc(ncn2)-c2ccccc2OC)c1
Show InChI InChI=1S/C22H26N3O3P/c1-4-28-29(26,5-2)15-17-9-8-10-18(13-17)25-22-14-20(23-16-24-22)19-11-6-7-12-21(19)27-3/h6-14,16H,4-5,15H2,1-3H3,(H,23,24,25)
Reactome pathway
n/an/a 197n/an/an/an/an/an/a
Vichem Chemie Ltd.
Curated by ChEMBL
Assay Description
Inhibition of CDK9/CycT1 (unknown origin) using TAMRA-Rbtide and ATP as substrate after 1 hr
J Med Chem 57: 3939-65 (2014)
Article DOI: 10.1021/jm401742r
BindingDB Entry DOI: 10.7270/Q28C9XRB