BDBM50013479 CHEMBL3264146
SMILES: CCCP(=O)(Cc1cccc(Nc2cc(ncn2)-c2ccccc2OCC)c1)OCC
InChI Key: InChIKey=SGDFLHLRJKFCHD-UHFFFAOYSA-N
Data: 1 IC50
Activity Spreadsheet -- Enzyme Inhibition Constant Data from BindingDB
Found 1 hit for monomerid = 50013479
Trg + Lig
Ki
nM
ΔG°
kcal/mole
IC50
nM
Kd
nM
EC50/IC50
nM
koff
s-1
kon
M-1s-1
pHTemp
°C
Cyclin-Dependent Kinase 9 (CDK9)
(Homo sapiens (Human))
BDBM50013479
(CHEMBL3264146)
Show SMILES CCCP(=O)(Cc1cccc(Nc2cc(ncn2)-c2ccccc2OCC)c1)OCC
Show InChI InChI=1S/C24H30N3O3P/c1-4-14-31(28,30-6-3)17-19-10-9-11-20(15-19)27-24-16-22(25-18-26-24)21-12-7-8-13-23(21)29-5-2/h7-13,15-16,18H,4-6,14,17H2,1-3H3,(H,25,26,27)
Reactome pathway
n/an/a 254n/an/an/an/an/an/a
Vichem Chemie Ltd.
Curated by ChEMBL
Assay Description
Inhibition of CDK9/CycT1 (unknown origin) using TAMRA-Rbtide and ATP as substrate after 1 hr
J Med Chem 57: 3939-65 (2014)
Article DOI: 10.1021/jm401742r
BindingDB Entry DOI: 10.7270/Q28C9XRB