BDBM50013564 2-(3-{2-[3-(1H-Tetrazol-5-yl)-phenyl]-vinyl}-phenoxymethyl)-quinoline::CHEMBL18381
SMILES: C(Oc1cccc(\C=C\c2cccc(c2)-c2nnn[nH]2)c1)c1ccc2ccccc2n1
InChI Key: InChIKey=UCBSPMZAFYGFLP-VAWYXSNFSA-N
Data: 1 KI
Activity Spreadsheet -- Enzyme Inhibition Constant Data from BindingDB
Found 1 hit for monomerid = 50013564
Trg + Lig
Ki
nM
ΔG°
kcal/mole
IC50
nM
Kd
nM
EC50/IC50
nM
koff
s-1
kon
M-1s-1
pHTemp
°C
Cysteinyl leukotriene receptor 1
(GUINEA PIG)
BDBM50013564
(2-(3-{2-[3-(1H-Tetrazol-5-yl)-phenyl]-vinyl}-pheno...)
Show SMILES C(Oc1cccc(\C=C\c2cccc(c2)-c2nnn[nH]2)c1)c1ccc2ccccc2n1
Show InChI InChI=1S/C25H19N5O/c1-2-10-24-20(7-1)13-14-22(26-24)17-31-23-9-4-6-19(16-23)12-11-18-5-3-8-21(15-18)25-27-29-30-28-25/h1-16H,17H2,(H,27,28,29,30)/b12-11+
8.5n/an/an/an/an/an/an/an/a
Rorer Central Research
Curated by ChEMBL
Assay Description
Binding affinity against Cysteinyl leukotriene D4 receptor from guinea pig lung was determined using [3H]-LTD4 (0.2 nM)
J Med Chem 33: 1194-200 (1990)
BindingDB Entry DOI: 10.7270/Q2PK0F4V