null
SMILES: [H][C@@]1([#6]-[#6][C@@]2([H])\[#6](-[#6]-[#6]-[#6][C@]12[#6])=[#6]\[#6]=[#6]-1/[#6]-[#6@@H](-[#8])-[#6](=[#6])-[#6@H](-[#8])-[#6]-1)[#6@H](-[#6])-[#6@@H](-[#6]-[#6]-[#8])-[#6]-[#6]-[#6]-[#6]
InChI Key: InChIKey=YCUJKCRUXHIWHW-VDYYGYAKSA-N
Activity Spreadsheet -- Enzyme Inhibition Constant Data from BindingDB
Found 1 hit for monomerid = 50013603
Trg + Lig
Ki
nM
ΔG°
kcal/mole
IC50
nM
Kd
nM
EC50/IC50
nM
koff
s-1
kon
M-1s-1
pHTemp
°C
Vitamin D3 receptor
(Homo sapiens (Human))
BDBM50013603
(CHEMBL3264160)
Show SMILES [H][C@@]1([#6]-[#6][C@@]2([H])\[#6](-[#6]-[#6]-[#6][C@]12[#6])=[#6]\[#6]=[#6]-1/[#6]-[#6@@H](-[#8])-[#6](=[#6])-[#6@H](-[#8])-[#6]-1)[#6@H](-[#6])-[#6@@H](-[#6]-[#6]-[#8])-[#6]-[#6]-[#6]-[#6] |r|
Show InChI InChI=1S/C28H46O3/c1-5-6-8-22(14-16-29)19(2)24-12-13-25-23(9-7-15-28(24,25)4)11-10-21-17-26(30)20(3)27(31)18-21/h10-11,19,22,24-27,29-31H,3,5-9,12-18H2,1-2,4H3/b23-11+/t19-,22-,24-,25+,26-,27-,28-/m1/s1
Reactome pathway
n/an/a 0.260n/an/an/an/an/an/a
Showa Pharmaceutical University
Curated by ChEMBL
Assay Description
Displacement of [3H]-1-alpha,25-dihydroxyvitamin D3 from N-terminal GST-tagged human recombinant VDR LBD expressed in Escherichia coli Rosetta2 (DE3)...
J Med Chem 57: 4351-67 (2014)
Article DOI: 10.1021/jm500392t
BindingDB Entry DOI: 10.7270/Q24M962V