BDBM50013610 CHEMBL3264165
SMILES: [H][C@@]1([#6]-[#6][C@@]2([H])\[#6](-[#6]-[#6]-[#6][C@]12[#6])=[#6]\[#6]=[#6]-1/[#6]-[#6@@H](-[#8])-[#6](=[#6])-[#6@H](-[#8])-[#6]-1)[#6@H](-[#6])-[#6@H](-[#6]-[#6])-[#6]-[#6]-[#6]-[#8]
InChI Key: InChIKey=UFMQDCNQCUYRNR-XDEVHWLRSA-N
Data: 1 IC50
Activity Spreadsheet -- Enzyme Inhibition Constant Data from BindingDB
Found 1 hit for monomerid = 50013610
Trg + Lig
Ki
nM
ΔG°
kcal/mole
IC50
nM
Kd
nM
EC50/IC50
nM
koff
s-1
kon
M-1s-1
pHTemp
°C
Vitamin D3 receptor
(Homo sapiens (Human))
BDBM50013610
(CHEMBL3264165)
Show SMILES [H][C@@]1([#6]-[#6][C@@]2([H])\[#6](-[#6]-[#6]-[#6][C@]12[#6])=[#6]\[#6]=[#6]-1/[#6]-[#6@@H](-[#8])-[#6](=[#6])-[#6@H](-[#8])-[#6]-1)[#6@H](-[#6])-[#6@H](-[#6]-[#6])-[#6]-[#6]-[#6]-[#8] |r|
Show InChI InChI=1S/C27H44O3/c1-5-21(9-7-15-28)18(2)23-12-13-24-22(8-6-14-27(23,24)4)11-10-20-16-25(29)19(3)26(30)17-20/h10-11,18,21,23-26,28-30H,3,5-9,12-17H2,1-2,4H3/b22-11+/t18-,21-,23-,24+,25-,26-,27-/m1/s1
Reactome pathway
n/an/a 7.20n/an/an/an/an/an/a
Showa Pharmaceutical University
Curated by ChEMBL
Assay Description
Displacement of [3H]-1-alpha,25-dihydroxyvitamin D3 from N-terminal GST-tagged human recombinant VDR LBD expressed in Escherichia coli Rosetta2 (DE3)...
J Med Chem 57: 4351-67 (2014)
Article DOI: 10.1021/jm500392t
BindingDB Entry DOI: 10.7270/Q24M962V