BDBM50013700 CHEMBL3264535
SMILES: Oc1cc(O)c2C[C@@H](OC(=O)[C@@H]3CC[C@H](F)CC3)[C@H](Oc2c1)c1ccc(O)c(O)c1
InChI Key: InChIKey=HEUZFWKOIMVRPK-USKJCTHSSA-N
Data: 1 IC50
Activity Spreadsheet -- Enzyme Inhibition Constant Data from BindingDB
Found 1 hit for monomerid = 50013700
Trg + Lig
Ki
nM
ΔG°
kcal/mole
IC50
nM
Kd
nM
EC50/IC50
nM
koff
s-1
kon
M-1s-1
pHTemp
°C
Heat shock protein HSP 90-beta
(Homo sapiens (Human))
BDBM50013700
(CHEMBL3264535)
Show SMILES Oc1cc(O)c2C[C@@H](OC(=O)[C@@H]3CC[C@H](F)CC3)[C@H](Oc2c1)c1ccc(O)c(O)c1 |r,wU:11.10,14.14,wD:18.24,7.7,(-.5,-47.41,;.84,-48.18,;.84,-49.73,;2.17,-50.5,;2.17,-52.04,;3.5,-49.73,;4.84,-50.51,;6.19,-49.73,;7.52,-50.51,;7.51,-52.05,;6.18,-52.81,;8.84,-52.82,;8.83,-54.36,;10.16,-55.13,;11.5,-54.37,;12.83,-55.14,;11.5,-52.82,;10.17,-52.05,;6.19,-48.18,;4.84,-47.4,;3.5,-48.18,;2.17,-47.41,;7.52,-47.41,;8.85,-48.19,;10.19,-47.43,;10.19,-45.89,;11.53,-45.12,;8.85,-45.11,;8.85,-43.57,;7.52,-45.88,)|
Show InChI InChI=1S/C22H23FO7/c23-13-4-1-11(2-5-13)22(28)30-20-10-15-17(26)8-14(24)9-19(15)29-21(20)12-3-6-16(25)18(27)7-12/h3,6-9,11,13,20-21,24-27H,1-2,4-5,10H2/t11-,13+,20-,21-/m1/s1
Reactome pathway
n/an/a 6.50E+4n/an/an/an/an/an/a
Montclair State University
Curated by ChEMBL
Assay Description
Inhibition of HSP90 (unknown origin) by luciferase refolding assay
Bioorg Med Chem Lett 24: 2263-6 (2014)
Article DOI: 10.1016/j.bmcl.2014.03.088
BindingDB Entry DOI: 10.7270/Q2RF5WK6