BDBM50013720 1-Phenyl-1H-pyrazolo[3,4-d]pyrimidin-4-ylamine::CHEMBL65063::PP3::cid_4879
SMILES: Nc1ncnc2n(ncc12)-c1ccccc1
InChI Key: InChIKey=KKDPIZPUTYIBFX-UHFFFAOYSA-N
Data: 2 KI  3 IC50
Activity Spreadsheet -- Enzyme Inhibition Constant Data from BindingDB
Found 5 hits for monomerid = 50013720
Trg + Lig
Ki
nM
ΔG°
kcal/mole
IC50
nM
Kd
nM
EC50/IC50
nM
koff
s-1
kon
M-1s-1
pHTemp
°C
Casein kinase I delta
(Rattus norvegicus (rat))
BDBM50013720
(1-Phenyl-1H-pyrazolo[3,4-d]pyrimidin-4-ylamine | C...)
Show SMILES Nc1ncnc2n(ncc12)-c1ccccc1
Show InChI InChI=1S/C11H9N5/c12-10-9-6-15-16(11(9)14-7-13-10)8-4-2-1-3-5-8/h1-7H,(H2,12,13,14)
9.90E+3n/an/an/an/an/an/an/an/a
University of Dundee
Curated by PDSP Ki Database
Biochem J 371: 199-204 (2003)
Article DOI: 10.1042/BJ20021535
BindingDB Entry DOI: 10.7270/Q2KH0KV9
Phosphatidylinositol 4-kinase type 2-alpha
(Homo sapiens (Human))
BDBM50013720
(1-Phenyl-1H-pyrazolo[3,4-d]pyrimidin-4-ylamine | C...)
Show SMILES Nc1ncnc2n(ncc12)-c1ccccc1
Show InChI InChI=1S/C11H9N5/c12-10-9-6-15-16(11(9)14-7-13-10)8-4-2-1-3-5-8/h1-7H,(H2,12,13,14)
1.10E+4n/an/an/an/an/an/an/an/a
Smith Kline& French Research Limited
Curated by ChEMBL
Assay Description
Binding affinity (Ki) against human phosphatidylinositol 4-kinase
J Med Chem 33: 2073-80 (1990)
BindingDB Entry DOI: 10.7270/Q25T3NQV
Rho-associated protein kinase 2
(Homo sapiens (Human))
BDBM50013720
(1-Phenyl-1H-pyrazolo[3,4-d]pyrimidin-4-ylamine | C...)
Show SMILES Nc1ncnc2n(ncc12)-c1ccccc1
Show InChI InChI=1S/C11H9N5/c12-10-9-6-15-16(11(9)14-7-13-10)8-4-2-1-3-5-8/h1-7H,(H2,12,13,14)
PCBioAssay
n/an/a 2.05E+4n/an/an/an/an/an/a
The Scripps Research Institute Molecular Screening Center
Curated by PubChem BioAssay
Assay Description
Source (MLSCN Center Name): The Scripps Research Institute Molecular Screening Center Center Affiliation: The Scripps Research Institute, TSRI Assay ...
PubChem Bioassay (2007)
BindingDB Entry DOI: 10.7270/Q2F769ZM
Phosphatidylinositol 4-kinase type 2-alpha
(Homo sapiens (Human))
BDBM50013720
(1-Phenyl-1H-pyrazolo[3,4-d]pyrimidin-4-ylamine | C...)
Show SMILES Nc1ncnc2n(ncc12)-c1ccccc1
Show InChI InChI=1S/C11H9N5/c12-10-9-6-15-16(11(9)14-7-13-10)8-4-2-1-3-5-8/h1-7H,(H2,12,13,14)
n/an/a 1.61E+4n/an/an/an/an/an/a
Smith Kline& French Research Limited
Curated by ChEMBL
Assay Description
Inhibitory activity (IC50) against human phosphatidylinositol 4-kinase at the ATP binding site
J Med Chem 33: 2073-80 (1990)
BindingDB Entry DOI: 10.7270/Q25T3NQV
cAMP-dependent protein kinase (PKA)
(Homo sapiens (Human))
BDBM50013720
(1-Phenyl-1H-pyrazolo[3,4-d]pyrimidin-4-ylamine | C...)
Show SMILES Nc1ncnc2n(ncc12)-c1ccccc1
Show InChI InChI=1S/C11H9N5/c12-10-9-6-15-16(11(9)14-7-13-10)8-4-2-1-3-5-8/h1-7H,(H2,12,13,14)
NCI pathway
Reactome pathway
PCBioAssay
n/an/a 2.11E+4n/an/an/an/an/an/a
The Scripps Research Institute Molecular Screening Center
Curated by PubChem BioAssay
Assay Description
Source (MLSCN Center Name): The Scripps Research Institute Molecular Screening Center Center Affiliation: The Scripps Research Institute, TSRI Assay ...
PubChem Bioassay (2007)
BindingDB Entry DOI: 10.7270/Q24X565S