BDBM50013881 CHEMBL3265312
SMILES: OCCCCc1cc(NS(=O)(=O)c2ccc(Br)cc2)c2ccccc2c1O
InChI Key: InChIKey=IVXYVHZTAHOSLF-UHFFFAOYSA-N
Data: 1 KI  1 IC50
Activity Spreadsheet -- Enzyme Inhibition Constant Data from BindingDB
Found 2 hits for monomerid = 50013881
Trg + Lig
Ki
nM
ΔG°
kcal/mole
IC50
nM
Kd
nM
EC50/IC50
nM
koff
s-1
kon
M-1s-1
pHTemp
°C
Induced myeloid leukemia cell differentiation protein Mcl-1
(Homo sapiens (Human))
BDBM50013881
(CHEMBL3265312)
Show SMILES OCCCCc1cc(NS(=O)(=O)c2ccc(Br)cc2)c2ccccc2c1O
Show InChI InChI=1S/C20H20BrNO4S/c21-15-8-10-16(11-9-15)27(25,26)22-19-13-14(5-3-4-12-23)20(24)18-7-2-1-6-17(18)19/h1-2,6-11,13,22-24H,3-5,12H2
NCI pathway
2.18E+3n/an/an/an/an/an/an/an/a
University of Michigan Medical School
Curated by ChEMBL
Assay Description
Displacement of Flu-BID/FAM-BID from His-tagged MCL1 (171 to 327) (unknown origin) expressed in Escherichia coli BL21(DE3) after 3 hrs by fluorescenc...
J Med Chem 57: 4111-33 (2014)
Article DOI: 10.1021/jm500010b
BindingDB Entry DOI: 10.7270/Q20003NC
Induced myeloid leukemia cell differentiation protein Mcl-1
(Homo sapiens (Human))
BDBM50013881
(CHEMBL3265312)
Show SMILES OCCCCc1cc(NS(=O)(=O)c2ccc(Br)cc2)c2ccccc2c1O
Show InChI InChI=1S/C20H20BrNO4S/c21-15-8-10-16(11-9-15)27(25,26)22-19-13-14(5-3-4-12-23)20(24)18-7-2-1-6-17(18)19/h1-2,6-11,13,22-24H,3-5,12H2
NCI pathway
n/an/a 1.97E+4n/an/an/an/an/an/a
University of Michigan Medical School
Curated by ChEMBL
Assay Description
Binding affinity to His-tagged MCL1 (171 to 327) (unknown origin) expressed in Escherichia coli BL21(DE3) assessed as inhibition of MCL1-N-terminal b...
J Med Chem 57: 4111-33 (2014)
Article DOI: 10.1021/jm500010b
BindingDB Entry DOI: 10.7270/Q20003NC