BDBM50013913 CHEMBL3260540
SMILES: CCOC(=O)[C@](C)(Cc1ccccc1)c1cnnc2c(cnn12)-c1ccc(cc1)C(F)(F)F
InChI Key: InChIKey=KDQVKAHGJRGYKP-HSZRJFAPSA-N
Data: 3 EC50
Activity Spreadsheet -- Enzyme Inhibition Constant Data from BindingDB
Found 3 hits for monomerid = 50013913
Trg + Lig
Ki
nM
ΔG°
kcal/mole
IC50
nM
Kd
nM
EC50/IC50
nM
koff
s-1
kon
M-1s-1
pHTemp
°C
Glucose-dependent insulinotropic receptor
(Mus musculus)
BDBM50013913
(CHEMBL3260540)
Show SMILES CCOC(=O)[C@](C)(Cc1ccccc1)c1cnnc2c(cnn12)-c1ccc(cc1)C(F)(F)F |r|
Show InChI InChI=1S/C24H21F3N4O2/c1-3-33-22(32)23(2,13-16-7-5-4-6-8-16)20-15-28-30-21-19(14-29-31(20)21)17-9-11-18(12-10-17)24(25,26)27/h4-12,14-15H,3,13H2,1-2H3/t23-/m1/s1
Reactome pathway
n/an/an/an/a 39n/an/an/an/a
Genomics Institute of the Novartis Research Foundation
Curated by ChEMBL
Assay Description
Agonist activity at mouse GPR119 overexpressed in CHO cells assessed as stimulation of cAMP production by HTRF assay
Bioorg Med Chem Lett 24: 2383-7 (2014)
Article DOI: 10.1016/j.bmcl.2014.03.023
BindingDB Entry DOI: 10.7270/Q2KP83P1
G-protein coupled receptor 119 (GPR119)
(Homo sapiens (Human))
BDBM50013913
(CHEMBL3260540)
Show SMILES CCOC(=O)[C@](C)(Cc1ccccc1)c1cnnc2c(cnn12)-c1ccc(cc1)C(F)(F)F |r|
Show InChI InChI=1S/C24H21F3N4O2/c1-3-33-22(32)23(2,13-16-7-5-4-6-8-16)20-15-28-30-21-19(14-29-31(20)21)17-9-11-18(12-10-17)24(25,26)27/h4-12,14-15H,3,13H2,1-2H3/t23-/m1/s1
n/an/an/an/a 20n/an/an/an/a
Genomics Institute of the Novartis Research Foundation
Curated by ChEMBL
Assay Description
Agonist activity at human GPR119 overexpressed in CHO cells assessed as stimulation of cAMP production by HTRF assay
Bioorg Med Chem Lett 24: 2383-7 (2014)
Article DOI: 10.1016/j.bmcl.2014.03.023
BindingDB Entry DOI: 10.7270/Q2KP83P1
Glucose-dependent insulinotropic receptor
(Mus musculus)
BDBM50013913
(CHEMBL3260540)
Show SMILES CCOC(=O)[C@](C)(Cc1ccccc1)c1cnnc2c(cnn12)-c1ccc(cc1)C(F)(F)F |r|
Show InChI InChI=1S/C24H21F3N4O2/c1-3-33-22(32)23(2,13-16-7-5-4-6-8-16)20-15-28-30-21-19(14-29-31(20)21)17-9-11-18(12-10-17)24(25,26)27/h4-12,14-15H,3,13H2,1-2H3/t23-/m1/s1
Reactome pathway
n/an/an/an/a 230n/an/an/an/a
Genomics Institute of the Novartis Research Foundation
Curated by ChEMBL
Assay Description
Agonist activity at GPR119 in mouse GLUTag cells assessed as stimulation of GLP1 secretion by CRE-luciferase reporter gene assay
Bioorg Med Chem Lett 24: 2383-7 (2014)
Article DOI: 10.1016/j.bmcl.2014.03.023
BindingDB Entry DOI: 10.7270/Q2KP83P1