null
SMILES: CCCCc1c(\C=C\C(=O)N[C@@H](C)CCCc2cccnc2)ccc2c(OC)cccc12
InChI Key: InChIKey=XWXTZIJSXURTPL-LAYTVVDLSA-N
Activity Spreadsheet -- Enzyme Inhibition Constant Data from BindingDB
Found 1 hit for monomerid = 50013921
Trg + Lig
Ki
nM
ΔG°
kcal/mole
IC50
nM
Kd
nM
EC50/IC50
nM
koff
s-1
kon
M-1s-1
pHTemp
°C
Platelet-activating factor receptor
(Homo sapiens (Human))
BDBM50013921
(3-(1-Butyl-5-methoxy-naphthalen-2-yl)-N-(1-methyl-...)
Show SMILES CCCCc1c(\C=C\C(=O)N[C@@H](C)CCCc2cccnc2)ccc2c(OC)cccc12
Show InChI InChI=1S/C28H34N2O2/c1-4-5-12-24-23(15-17-26-25(24)13-7-14-27(26)32-3)16-18-28(31)30-21(2)9-6-10-22-11-8-19-29-20-22/h7-8,11,13-21H,4-6,9-10,12H2,1-3H3,(H,30,31)/b18-16+/t21-/m0/s1
Reactome pathway
n/an/a 6n/an/an/an/an/an/a
Hoffmann-La Roche Inc.
Curated by ChEMBL
Assay Description
Inhibition of [3H]-PAF binding to platelet activating factor receptor citrate-treated dog blood
J Med Chem 33: 2856-64 (1990)
BindingDB Entry DOI: 10.7270/Q21V5CZJ